{"text_format":"1","workbook":"xlsx","n_sheets":19,"sheets":["Macro for checks","Consolidated template","Mobilisation","List of codes","MOB_validation","TOSSD_or_other_codelist","type_of_finance","channel_codes","type_of_aid","donor_agency","Marker","Currency","purpose_code","SDG_focus","type_of_flow","recipient_country","nature_of_submission","Data validation sheet","Mobilisation codes"],"not_rendered":{"charts":0,"images":0,"macros":1,"external_links":3,"defined_names":808,"comments":1,"pivot_tables":0},"unopened":[],"bounds":{"document_bytes":16777216,"sheet_cells":100000,"rows_first":2000,"rows_last":500,"rows_between":2000,"halvings":0,"cell_chars":16384,"cell_head_chars":4096},"cells_cut":0,"cells_raw":0,"read":"whole","date_system":"1900"}

{"sheet":"Macro for checks","index":0,"n_rows":11,"n_cols":2,"rows_kept":11,"cut":false,"hidden":false,"merged":[[1,1,1,3],[10,1,10,3]]}
[]
[null,"Press button below to launch the macro for checks:"]
[]
[]
[]
[]
[]
[]
[]
[]
[null,"*Checks are still under development and can take a few minutes to run. Please be advised that the checks reference columns by number so please ensure the original columns are in the same order as the initial template. Ensure to fill in the \"Reporting year\" for each activity before running."]

{"sheet":"Consolidated template","index":1,"n_rows":6,"n_cols":39,"rows_kept":6,"cut":false,"hidden":false,"merged":[]}
["A Identification data",null,null,null,null,null,"B. Basic data",null,null,null,null,null,null,null,null,null,null,null,null,null,"C. Volume data",null,null,null,"For mobilisation only","For loans only",null,"For mobilisation only",null,"For CRS reporting only",null,null,null,null,null,null,"Key words"]
["1. Reporting year","2. Provider","3. Agency","4. Provider project number  ","4b. IATI Identifier (NEW)","5. ID Number","6. Recipient","7. Project title","8. Description","9. External link ","10. SDG focus\n(multiple codes separated by \";\")","11. Sector \n(multiple codes and associated percentages, separated by \"|\")","12. Channel","13. Channel name (free text)","13.b Other partners","14. Modality","15. Financial instrument","16. Financing arrangement","17. Framework of collaboration","18. TOSSD pillar","19. Currency","20. Amount committed (thousand)","21. Amount disbursed (thousand)","22. Reflows to the provider (thousand)","23. Amounts mobilised from the private sector (thousand)","24. Concessionality","25. Maturity (in months)","26. Leveraging mechanism","27. Origin of the funds mobilised","28. Climate change mitigation","29. Climate change adaptation","30. Climate change overlap (for component approach only)","31. Gender Marker","32. Biodiversity","33. Desertification","34. Disability","35. Key words (e.g. for climate change mitigation: #MITIGATION)","36. Interest rates on loans / return on equities","Notes"]
[2025,"MDBName",1,"123abc",null,2025000001,248,"Financial inclusion in Turkana. Kenya","To foster financial inclusion through access to climate-resilient microfinance by disabled female entrepreneurs facing distortive effects of the COVID-19 pandemic and advanced desertification conditions.","www.abcancabc.a","1.4;5.1;8.3;8.10;10.2;17.1;17.3",24040,62002,"TurkanaBanq Ltd.","Turkana County Government, UNCDF","C01",421,"FA01",null,1,"USD",20000,18678.147939999999,0,11785.714285714301,0,56,1,3,0,67,0,2,0,1,null,"#ADAPTATION","05200","Example: A blended finance loan to a local finance institution in Kenya with private finance mobilisation, committed in 2021 and partially disbursed in 2021. It is part of providers' COVID-19 response."]
[2025,"MDBName",2,"987mno",null,2025000002,425,"Solar part in Patagonia","To increase energy access in the mountain regions of Souther Patagonia, Argentina","www.abcancabc.a","7.1;7.2;13.0","23230",62009,"Joint venture ABZ",null,"C01",510,"FA01; FA02","FC01",1,"USD",0,0,5784,0,null,null,null,null,null,null,null,null,null,null,null,"#MITIGATION; #BIODIVERSITY",null,"Example: An Islamic finance equity investment committed and disbursed in the past, with sales (reflows) in 2021, extended by a South-South provider. Also considered blended finance."]
[2025,"MDBName",4,"Z123Y",null,2025000003,1031,"Study on custom system in the Caribbean","Study on custom system in the Caribbean","www.abcancabc.a","17.10;17.12","33110",49999,"MDBName",null,"K02",2100,null,null,21,"USD",234,234,0,0,null,null,null,null,null,null,null,null,null,null,null,null,null,"Example: Direct expenditure in 2021 in the form of research."]
[2025,"MDBName",3,"456xyz",null,2025000004,645,"Budget support to Indian government to improve access to fresh water in South India","To improve accessibility of fresh water in the countryside of South India and address desertification.","www.abcancabc.a","1.4;6.1;13.1","14031:80|14081:20",12001,"Government of India",null,"A00",110,"FA03",null,1,"USD",0,4571.8,0,0,null,null,null,null,null,null,null,null,null,null,null,"#DESERTIFICATION",null,"Example: A general budget support through a grant to the Government of India, with co-financed by the local government. It was committed in the past and in 2021 partially disbursed."]

{"sheet":"Mobilisation","index":2,"n_rows":201,"n_cols":58,"rows_kept":201,"cut":false,"hidden":false,"merged":[[1,15,1,17],[1,18,3,18],[1,19,1,24],[2,15,3,15],[2,16,3,16],[2,17,3,17],[2,19,3,19],[2,21,3,21],[2,20,3,20],[1,25,1,33],[0,0,0,17],[0,19,0,34],[2,23,3,23],[2,24,3,24],[2,26,2,27],[2,28,2,30],[2,31,2,33],[1,34,3,34],[2,0,3,0],[2,1,3,1],[2,2,3,2],[2,3,3,3],[2,4,2,14],[2,22,3,22],[1,0,1,14]]}
["BASIC IDENTIFICATION FIELDS AND AMOUNTS MOBILISED (as in the consolidated template)",null,null,null,null,null,null,null,null,null,null,null,null,null,null,null,null,null,null,"SUPPLEMENTARY DATA, USED FOR CHECKING PURPOSES ONLY"]
["IDENTIFICATION AND DESCRIPTIVE INFORMATION",null,null,null,null,null,null,null,null,null,null,null,null,null,null,"MOBILISATION",null,null,"CHECK FIELD \n(as per OECD calculation)","FIELDS FOR ALL INSTRUMENTS",null,null,null,null,null,"INSTRUMENT-SPECIFIC FIELDS",null,null,null,null,null,null,null,null,"Notes"]
["Reporting year","Agency","Provider project number","ID number","Only if link with the consolidated template cannot be made using provider project number or ID number:",null,null,null,null,null,null,null,null,null,null,"Amounts mobilised from the private sector","Leveraging mechanism and role/ position","Origin of the funds mobilised",null,"Type of PILOT (if relevant): \nOther \"baskets\" of Mobilisation and Generation ","Methodology used for reporting in data field 23","Amounts invested by your institution \n(or exposure value / share for guarantees)","Total official funding, including your institution\n(or total public exposure for guarantees)","Private finance before attribution\n(for credit lines: LFI top-up funds)","Project finance SPV flag \n(1=Yes)","Syndicated loans","Shares in CIVs, companies and project finance SPVs",null,"Credit lines / second level mobilisation through CIV (data PILOTS only)",null,null,"Technical Assistance"]
[null,null,null,null,"Recipient code","Project title","SDG focus","Concessionality","Sector ","CC mitigation","CC adaptation","CC Overlap  \n(for component only)","Gender","Biodiveristy","Currency",null,null,null,null,null,null,null,null,null,null,"Type of arranger","Number of official investors in the riskiest tranche (incl. your instituion)","Number of official investors in the mezzanine/senior tranche (incl. your institution)","Expected share of the CIV’s investment in total investee’s equity \n(for data PILOTS only)","Revolving factor \n(credit lines, pilot on debt funds) / \nExpected use of CIV's funds \n(pilot on equity funds)\n\n(if not available,  \n enter 1)","Amount of end-borrowers' equities \n(for pilot on equity funds, as % total investees') ","TA flag","Names of other official financiers","Justification of the mobilisation effect and finaning structure description (and useful links)",null,null,null,"Levmech: CODE","LOOKUP ROW","1=Syndicated loan, arranger","2=Syndicated loan, participant","3=Common shares in flat collective investment vehicle","4=Shares in the riskiest tranche of structured collective investment vehicle, first-loss shares and others (e.g. lock-up shares)","5=Shares in the mezzanine/senior tranche of structured CIV","6=Guarantee/insurance ","7=Direct investment in companies, equity","8=Direct investment in companies, mezzanine/senior debt","9=Credit lines","10=Co-financing arrangements","11= Portfolio mobilisation, investment exists (debt or equity) (PILOT) ","12=Porfolio mobilisation, risk transfer through securitisation (PILOT","13=Portfolio mobilisation, risk transfer through portfolio insurance (PILOT)","14= Balance sheet operations, equity (PILOT)","15= Balance sheet operations, hybrid capital (PILOT)","16= Balance sheet operations, bond issuance (PILOT)"]
[1,3,4,5,6,7,10,24,11,28,29,30,31,32,19,23,26,27,null,"More guidance HERE","S0","S1","S2","S3","S4","S5","S6","S7","S7b","S8","S9","TA1","TA2","TA3",null,null,null,null,1,1,2,3,4,5,6,7,8,9,10,11,12,13,14,15,16]
[null,null,null,null,null,null,null,null,null,null,null,null,null,null,null,null,null,null,{"$f":"IF(LEN(Q6)=0,\"\",HLOOKUP(AL6,$AN$5:$BC$200,AM6,FALSE))","v":""},null,null,null,null,null,null,{"$f":"IFERROR(IF(Q6=\"1=Syndicated loan, arranger\",\"1=Official institution\",IF(Q6=1,\"1=Official institution\",\"\")),\"\")","v":""},null,null,null,null,null,null,null,null,null,null,null,{"$f":"IFERROR(VLOOKUP(Q6,BE:BF,2,FALSE),\"\")","v":""},{"$f":"AM5+1","v":2},{"$f":"IF(V6>W6,\"B cannot be higher than C\",IF(COUNTA(V6:X6)=0,\"Fill in supplementary fields\",IFERROR(IF(VALUE(LEFT(Z6,1))=1,X6/2+(V6/W6)*(X6/2),IF(VALUE(LEFT(Z6,1))=2,\"impossible combination\",\"check not available\")),\"\")))","v":"Fill in supplementary fields"},{"$f":"IF(V6>W6,\"B cannot be higher than C\",IF(COUNTA(V6:X6)=0,\"Fill in supplementary fields\",IFERROR(IF(VALUE(LEFT(Z6,1))=1,(V6/W6)*(X6/2),IF(VALUE(LEFT(Z6,1))=2,(V6/W6)*(X6),\"check not available\")),\"\")))","v":"Fill in supplementary fields"},{"$f":"IF(V6>W6,\"B cannot be higher than C\",IF(COUNTA(AA6:AB6)=0,\"Fill in supplementary fields\",(X6/2)*(V6/W6)+(X6/2)*(1/SUM(AA6:AB6))))+(IF(LEFT(T6,1)=\"1\",((V18*AD18)*(AE18/(1-AE18))),IF(LEFT(T6,1)=\"2\",IF(COUNTA(V6:X6)=0,\"Fill in supplementary fields\",(W6+X6)*AE6*AD6))))","v":{"$error":"#VALUE!"}},{"$f":"IF(V6>W6,\"B cannot be higher than C\",IFERROR(IF(COUNTA(AA6:AB6)=0,\"Fill in supplementary fields\",X6/2)*(V6/W6)+(X6/2)*(1/AA6),\"Fill in supplementary fields\"))+(IF(LEFT(T6,1)=\"1\",((V18*AD18)*(AE18/(1-AE18))),IF(LEFT(T6,1)=\"2\",IF(COUNTA(V6:X6)=0,\"Fill in supplementary fields\",(W6+X6)*AE6*AD6))))","v":{"$error":"#VALUE!"}},{"$f":"IF(V6>W6,\"B cannot be higher than C\",IFERROR(IF(COUNTA(AA6:AB6)=0,\"Fill in supplementary fields\",IF(AA6=0,X6/2*(V6/W6)+X6/2*(1/AB6),(X6/2)*(V6/W6))),\"Fill in supplementary fields\"))+(IF(LEFT(T6,1)=\"1\",((V18*AD18)*(AE18/(1-AE18))),IF(LEFT(T6,1)=\"2\",IF(COUNTA(V6:X6)=0,\"Fill in supplementary fields\",(W6+X6)*AE6*AD6))))","v":{"$error":"#VALUE!"}},{"$f":"IF(V6>W6,\"B cannot be higher than C\",IF(COUNTA(V6:X6)=0,\"Enter exposure values in fields A and B\",(X6)*(V6/W6)))","v":"Enter exposure values in fields A and B"},{"$f":"IF(V6>W6,\"B cannot be higher than C\",IFERROR(IF(COUNTA(AA6:AB6)=0,\"Fill in supplementary fields\",X6/2)*(V6/W6)+(X6/2)*(1/AA6),\"Fill in supplementary fields\"))","v":"Fill in supplementary fields"},{"$f":"IF(V6>W6,\"B cannot be higher than C\",IFERROR(IF(COUNTA(AA6:AB6)=0,\"Fill in supplementary fields\",IF(AA6=0,X6/2*(V6/W6)+X6/2*(1/AB6),(X6/2)*(V6/W6))),\"Fill in supplementary fields\"))","v":"Fill in supplementary fields"},{"$f":"IF(V6>W6,\"B cannot be higher than C\",IF(COUNTA(V6:X6)=0,\"Fill in supplementary fields\",(V6/W6)*((X6)+AD6*AE6)))","v":"Fill in supplementary fields"},{"$f":"IF(V6>W6,\"B cannot be higher than C\",IF(COUNTA(V6:X6)=0,\"Fill in supplementary fields\",(X6)*(V6/W6)))","v":"Fill in supplementary fields"},{"$f":"$X6","v":0},0,0,0,0,0,0,"1=Syndicated loan, arranger",{"$f":"VALUE(LEFT(BE6,FIND(\"=\",BE6)-1))","v":1}]
[null,null,null,null,null,null,null,null,null,null,null,null,null,null,null,null,null,null,"",null,null,null,null,null,null,"",null,null,null,null,null,null,null,null,null,null,null,"",3,"Fill in supplementary fields","Fill in supplementary fields",{"$f":"IF(V7>W7,\"B cannot be higher than C\",IF(COUNTA(AA7:AB7)=0,\"Fill in supplementary fields\",(X7/2)*(V7/W7)+(X7/2)*(1/SUM(AA7:AB7))))+(IF(LEFT(T7,1)=\"1\",((W7+X7)/AC7)*(V7/(W7+X7))*AD7*AE7*(AC7/(1-AE7)),IF(LEFT(T7,1)=\"2\",IF(COUNTA(V7:X7)=0,\"Fill in supplementary fields\",(W7+X7)*AE7*AD7))))","v":{"$error":"#VALUE!"}},{"$f":"IF(V7>W7,\"B cannot be higher than C\",IFERROR(IF(COUNTA(AA7:AB7)=0,\"Fill in supplementary fields\",X7/2)*(V7/W7)+(X7/2)*(1/AA7),\"Fill in supplementary fields\"))+(IF(LEFT(T7,1)=\"1\",((W7+X7)/AC7)*(V7/(W7+X7))*AD7*AE7*(AC7/(1-AE7)),IF(LEFT(T7,1)=\"2\",IF(COUNTA(V7:X7)=0,\"Fill in supplementary fields\",(W7+X7)*AE7*AD7))))","v":{"$error":"#VALUE!"}},{"$f":"IF(V7>W7,\"B cannot be higher than C\",IFERROR(IF(COUNTA(AA7:AB7)=0,\"Fill in supplementary fields\",IF(AA7=0,X7/2*(V7/W7)+X7/2*(1/AB7),(X7/2)*(V7/W7))),\"Fill in supplementary fields\"))+(IF(LEFT(T7,1)=\"1\",((W7+X7)/AC7)*(V7/(W7+X7))*AD7*AE7*(AC7/(1-AE7)),IF(LEFT(T7,1)=\"2\",IF(COUNTA(V7:X7)=0,\"Fill in supplementary fields\",(W7+X7)*AE7*AD7))))","v":{"$error":"#VALUE!"}},"Enter exposure values in fields A and B","Fill in supplementary fields","Fill in supplementary fields","Fill in supplementary fields","Fill in supplementary fields",0,0,0,0,0,0,0,"2=Syndicated loan, participant",{"$f":"VALUE(LEFT(BE7,FIND(\"=\",BE7)-1))","v":2}]
[null,null,"123abc",2025000001,null,null,null,0,null,null,null,null,null,null,"USD",10714.3,"4=Shares in the riskiest tranche of structured collective investment vehicle, first-loss shares and others (e.g. lock-up shares)","2=Recipient country ",10714.285714285714,null,"1=OECD",20000,35000,20000,null,"",2,1,null,null,null,null,null,null,"Example",null,null,4,4,"","",9047.6190476190459,10714.285714285714,5714.2857142857138,11428.571428571428,10714.285714285714,5714.2857142857138,11428.571428571428,11428.571428571428,20000,20000,20000,20000,20000,20000,20000,"3=Common shares in flat collective investment vehicle",3]
[null,null,"123abc",{"$f":"D8+1","v":2025000002},null,null,null,0,null,null,null,null,null,null,"USD",15000,"11=Portfolio mobilisation, Investment exists (debt or equity) (PILOT) ","3=Third high income/OECD country",15000,"3= Portfolio mobilisation","1=OECD",3000,3000,15000,null,"",null,null,null,null,null,null,null,null,"Example",null,null,11,5,"","",{"$f":"IF(V9>W9,\"B cannot be higher than C\",IF(COUNTA(AA9:AB9)=0,\"Fill in supplementary fields\",(X9/2)*(V9/W9)+(X9/2)*(1/SUM(AA9:AB9))))+(IF(LEFT(T9,1)=\"1\",((V21*AD21)*(AE21/(1-AE21))),IF(LEFT(T9,1)=\"2\",IF(COUNTA(V9:X9)=0,\"Fill in supplementary fields\",(W9+X9)*AE9*AD9))))","v":{"$error":"#VALUE!"}},{"$f":"IF(V9>W9,\"B cannot be higher than C\",IFERROR(IF(COUNTA(AA9:AB9)=0,\"Fill in supplementary fields\",X9/2)*(V9/W9)+(X9/2)*(1/AA9),\"Fill in supplementary fields\"))+(IF(LEFT(T9,1)=\"1\",((V21*AD21)*(AE21/(1-AE21))),IF(LEFT(T9,1)=\"2\",IF(COUNTA(V9:X9)=0,\"Fill in supplementary fields\",(W9+X9)*AE9*AD9))))","v":{"$error":"#VALUE!"}},{"$f":"IF(V9>W9,\"B cannot be higher than C\",IFERROR(IF(COUNTA(AA9:AB9)=0,\"Fill in supplementary fields\",IF(AA9=0,X9/2*(V9/W9)+X9/2*(1/AB9),(X9/2)*(V9/W9))),\"Fill in supplementary fields\"))+(IF(LEFT(T9,1)=\"1\",((V21*AD21)*(AE21/(1-AE21))),IF(LEFT(T9,1)=\"2\",IF(COUNTA(V9:X9)=0,\"Fill in supplementary fields\",(W9+X9)*AE9*AD9))))","v":{"$error":"#VALUE!"}},15000,"Fill in supplementary fields","Fill in supplementary fields",15000,15000,15000,15000,15000,15000,15000,15000,15000,"4=Shares in the riskiest tranche of structured collective investment vehicle, first-loss shares and others (e.g. lock-up shares)",4]
[null,null,"123abc",{"$f":"D9+1","v":2025000003},null,null,null,0,null,null,null,null,null,null,"USD",8800,"4=Shares in the riskiest tranche of structured collective investment vehicle, first-loss shares and others (e.g. lock-up shares)","4=Other third country",8800,"1 = Second-level flows mobilised through CIVs, equity funds ","1=OECD",16000,16000,6000,null,"",1,null,0.5,0.7,0.2,null,null,null,"Example",null,null,4,6,"","",{"$f":"IF(V10>W10,\"B cannot be higher than C\",IF(COUNTA(AA10:AB10)=0,\"Fill in supplementary fields\",(X10/2)*(V10/W10)+(X10/2)*(1/SUM(AA10:AB10))))+(IF(LEFT(T10,1)=\"1\",((W10+X10)/AC10)*(V10/(W10+X10))*AD10*AE10*(AC10/(1-AE10)),IF(LEFT(T10,1)=\"2\",IF(COUNTA(V10:X10)=0,\"Fill in supplementary fields\",(W10+X10)*AE10*AD10))))","v":8800},{"$f":"IF(V10>W10,\"B cannot be higher than C\",IFERROR(IF(COUNTA(AA10:AB10)=0,\"Fill in supplementary fields\",X10/2)*(V10/W10)+(X10/2)*(1/AA10),\"Fill in supplementary fields\"))+(IF(LEFT(T10,1)=\"1\",((W10+X10)/AC10)*(V10/(W10+X10))*AD10*AE10*(AC10/(1-AE10)),IF(LEFT(T10,1)=\"2\",IF(COUNTA(V10:X10)=0,\"Fill in supplementary fields\",(W10+X10)*AE10*AD10))))","v":8800},{"$f":"IF(V10>W10,\"B cannot be higher than C\",IFERROR(IF(COUNTA(AA10:AB10)=0,\"Fill in supplementary fields\",IF(AA10=0,X10/2*(V10/W10)+X10/2*(1/AB10),(X10/2)*(V10/W10))),\"Fill in supplementary fields\"))+(IF(LEFT(T10,1)=\"1\",((W10+X10)/AC10)*(V10/(W10+X10))*AD10*AE10*(AC10/(1-AE10)),IF(LEFT(T10,1)=\"2\",IF(COUNTA(V10:X10)=0,\"Fill in supplementary fields\",(W10+X10)*AE10*AD10))))","v":5800},6000,6000,3000,6000.14,6000,6000,6000,6000,6000,6000,6000,6000,"5=Shares in the mezzanine/senior tranche of structured CIV",5]
[null,null,"123abc",2025000004,null,null,null,0,null,null,null,null,null,null,"USD",11160,"3=Common shares in flat collective investment vehicle","4=Other third country",11160,"2 = Second-level flows mobilised through CIVs, debt funds ","1=OECD",14000,14000,3000,null,"",1,null,null,1.6,0.3,null,null,null,"Example",null,null,3,7,"","",11160,11160,9660,3000,3000,1500,3000.48,3000,3000,3000,3000,3000,3000,3000,3000,"6=Guarantee/insurance ",6]
[null,null,"123abc",2025000005,null,null,null,0,null,null,null,null,null,null,"USD",25000,"6=Guarantee/insurance ","2=Recipient country ",40000,null,"1=OECD",25000,25000,40000,null,"",null,null,null,null,null,null,null,null,"Example",null,null,6,{"$f":"AM11+1","v":8},"","",{"$f":"IF(V12>W12,\"B cannot be higher than C\",IF(COUNTA(AA12:AB12)=0,\"Fill in supplementary fields\",(X12/2)*(V12/W12)+(X12/2)*(1/SUM(AA12:AB12))))+(IF(LEFT(T12,1)=\"1\",((V24*AD24)*(AE24/(1-AE24))),IF(LEFT(T12,1)=\"2\",IF(COUNTA(V12:X12)=0,\"Fill in supplementary fields\",(W12+X12)*AE12*AD12))))","v":{"$error":"#VALUE!"}},{"$f":"IF(V12>W12,\"B cannot be higher than C\",IFERROR(IF(COUNTA(AA12:AB12)=0,\"Fill in supplementary fields\",X12/2)*(V12/W12)+(X12/2)*(1/AA12),\"Fill in supplementary fields\"))+(IF(LEFT(T12,1)=\"1\",((V24*AD24)*(AE24/(1-AE24))),IF(LEFT(T12,1)=\"2\",IF(COUNTA(V12:X12)=0,\"Fill in supplementary fields\",(W12+X12)*AE12*AD12))))","v":{"$error":"#VALUE!"}},{"$f":"IF(V12>W12,\"B cannot be higher than C\",IFERROR(IF(COUNTA(AA12:AB12)=0,\"Fill in supplementary fields\",IF(AA12=0,X12/2*(V12/W12)+X12/2*(1/AB12),(X12/2)*(V12/W12))),\"Fill in supplementary fields\"))+(IF(LEFT(T12,1)=\"1\",((V24*AD24)*(AE24/(1-AE24))),IF(LEFT(T12,1)=\"2\",IF(COUNTA(V12:X12)=0,\"Fill in supplementary fields\",(W12+X12)*AE12*AD12))))","v":{"$error":"#VALUE!"}},40000,"Fill in supplementary fields","Fill in supplementary fields",40000,40000,40000,40000,40000,40000,40000,40000,40000,"7=Direct investment in companies/SPVs, equity",7]
[null,null,"123abc",2025000006,null,null,null,0,null,null,null,null,null,null,"USD ",8000,"12=Porfolio mobilisation, Risk transfer through securitisation (PILOT)","3=Third high income/OECD country",8000,"3= Portfolio mobilisation","1=OECD",100000,100000,8000,null,"",null,null,null,null,null,null,null,null,"Example",null,null,12,9,"","",{"$f":"IF(V13>W13,\"B cannot be higher than C\",IF(COUNTA(AA13:AB13)=0,\"Fill in supplementary fields\",(X13/2)*(V13/W13)+(X13/2)*(1/SUM(AA13:AB13))))+(IF(LEFT(T13,1)=\"1\",((W13+X13)/AC13)*(V13/(W13+X13))*AD13*AE13*(AC13/(1-AE13)),IF(LEFT(T13,1)=\"2\",IF(COUNTA(V13:X13)=0,\"Fill in supplementary fields\",(W13+X13)*AE13*AD13))))","v":{"$error":"#VALUE!"}},{"$f":"IF(V13>W13,\"B cannot be higher than C\",IFERROR(IF(COUNTA(AA13:AB13)=0,\"Fill in supplementary fields\",X13/2)*(V13/W13)+(X13/2)*(1/AA13),\"Fill in supplementary fields\"))+(IF(LEFT(T13,1)=\"1\",((W13+X13)/AC13)*(V13/(W13+X13))*AD13*AE13*(AC13/(1-AE13)),IF(LEFT(T13,1)=\"2\",IF(COUNTA(V13:X13)=0,\"Fill in supplementary fields\",(W13+X13)*AE13*AD13))))","v":{"$error":"#VALUE!"}},{"$f":"IF(V13>W13,\"B cannot be higher than C\",IFERROR(IF(COUNTA(AA13:AB13)=0,\"Fill in supplementary fields\",IF(AA13=0,X13/2*(V13/W13)+X13/2*(1/AB13),(X13/2)*(V13/W13))),\"Fill in supplementary fields\"))+(IF(LEFT(T13,1)=\"1\",((W13+X13)/AC13)*(V13/(W13+X13))*AD13*AE13*(AC13/(1-AE13)),IF(LEFT(T13,1)=\"2\",IF(COUNTA(V13:X13)=0,\"Fill in supplementary fields\",(W13+X13)*AE13*AD13))))","v":{"$error":"#VALUE!"}},8000,"Fill in supplementary fields","Fill in supplementary fields",8000,8000,8000,8000,8000,8000,8000,8000,8000,"8=Direct investment in companies/SPVs, mezzanine/senior debt",8]
[null,null,"123abc",2025000007,null,null,null,0,null,null,null,null,null,null,"USD",400000,"16=Generation, bond issuance (PILOT)","3=Third high income/OECD country",400000,"4= Generation","1=OECD",500000,500000,400000,null,"",null,null,null,null,null,null,null,null,"Example",null,null,16,10,"","",{"$error":"#VALUE!"},{"$error":"#VALUE!"},{"$error":"#VALUE!"},400000,"Fill in supplementary fields","Fill in supplementary fields",400000,400000,400000,400000,400000,400000,400000,400000,400000,"9=Credit lines",9]
[null,null,"123abc",2025000008,null,null,null,0,null,null,null,null,null,null,"USD",200000,"1=Syndicated loan, arranger","2=Recipient country ",200000,null,"1=OECD",100000,100000,200000,null,"1=Official institution",null,null,null,null,null,null,null,null,"Example",null,null,1,11,200000,100000,{"$f":"IF(V15>W15,\"B cannot be higher than C\",IF(COUNTA(AA15:AB15)=0,\"Fill in supplementary fields\",(X15/2)*(V15/W15)+(X15/2)*(1/SUM(AA15:AB15))))+(IF(LEFT(T15,1)=\"1\",((V27*AD27)*(AE27/(1-AE27))),IF(LEFT(T15,1)=\"2\",IF(COUNTA(V15:X15)=0,\"Fill in supplementary fields\",(W15+X15)*AE15*AD15))))","v":{"$error":"#VALUE!"}},{"$f":"IF(V15>W15,\"B cannot be higher than C\",IFERROR(IF(COUNTA(AA15:AB15)=0,\"Fill in supplementary fields\",X15/2)*(V15/W15)+(X15/2)*(1/AA15),\"Fill in supplementary fields\"))+(IF(LEFT(T15,1)=\"1\",((V27*AD27)*(AE27/(1-AE27))),IF(LEFT(T15,1)=\"2\",IF(COUNTA(V15:X15)=0,\"Fill in supplementary fields\",(W15+X15)*AE15*AD15))))","v":{"$error":"#VALUE!"}},{"$f":"IF(V15>W15,\"B cannot be higher than C\",IFERROR(IF(COUNTA(AA15:AB15)=0,\"Fill in supplementary fields\",IF(AA15=0,X15/2*(V15/W15)+X15/2*(1/AB15),(X15/2)*(V15/W15))),\"Fill in supplementary fields\"))+(IF(LEFT(T15,1)=\"1\",((V27*AD27)*(AE27/(1-AE27))),IF(LEFT(T15,1)=\"2\",IF(COUNTA(V15:X15)=0,\"Fill in supplementary fields\",(W15+X15)*AE15*AD15))))","v":{"$error":"#VALUE!"}},200000,"Fill in supplementary fields","Fill in supplementary fields",200000,200000,200000,200000,200000,200000,200000,200000,200000,"10=Simple co-financing arrangements",10]
[null,null,"123abc",2025000009,null,null,null,0,null,null,null,null,null,null,"USD",30000,"6=Guarantee/insurance ","1=Provider country",30000,null,"1=OECD",20000,20000,30000,null,"",null,null,null,null,null,null,null,null,null,null,null,6,12,"","",{"$f":"IF(V16>W16,\"B cannot be higher than C\",IF(COUNTA(AA16:AB16)=0,\"Fill in supplementary fields\",(X16/2)*(V16/W16)+(X16/2)*(1/SUM(AA16:AB16))))+(IF(LEFT(T16,1)=\"1\",((W16+X16)/AC16)*(V16/(W16+X16))*AD16*AE16*(AC16/(1-AE16)),IF(LEFT(T16,1)=\"2\",IF(COUNTA(V16:X16)=0,\"Fill in supplementary fields\",(W16+X16)*AE16*AD16))))","v":{"$error":"#VALUE!"}},{"$f":"IF(V16>W16,\"B cannot be higher than C\",IFERROR(IF(COUNTA(AA16:AB16)=0,\"Fill in supplementary fields\",X16/2)*(V16/W16)+(X16/2)*(1/AA16),\"Fill in supplementary fields\"))+(IF(LEFT(T16,1)=\"1\",((W16+X16)/AC16)*(V16/(W16+X16))*AD16*AE16*(AC16/(1-AE16)),IF(LEFT(T16,1)=\"2\",IF(COUNTA(V16:X16)=0,\"Fill in supplementary fields\",(W16+X16)*AE16*AD16))))","v":{"$error":"#VALUE!"}},{"$f":"IF(V16>W16,\"B cannot be higher than C\",IFERROR(IF(COUNTA(AA16:AB16)=0,\"Fill in supplementary fields\",IF(AA16=0,X16/2*(V16/W16)+X16/2*(1/AB16),(X16/2)*(V16/W16))),\"Fill in supplementary fields\"))+(IF(LEFT(T16,1)=\"1\",((W16+X16)/AC16)*(V16/(W16+X16))*AD16*AE16*(AC16/(1-AE16)),IF(LEFT(T16,1)=\"2\",IF(COUNTA(V16:X16)=0,\"Fill in supplementary fields\",(W16+X16)*AE16*AD16))))","v":{"$error":"#VALUE!"}},30000,"Fill in supplementary fields","Fill in supplementary fields",30000,30000,30000,30000,30000,30000,30000,30000,30000,"11=Portfolio mobilisation, investment exists (debt or equity) (PILOT) ",11]
[null,null,"123abc",2025000010,null,null,null,0,null,null,null,null,null,null,"USD",40000,"9=Credit lines","2=Recipient country ",40000,null,"1=OECD",10000,10000,15000,null,"",null,null,null,1,25000,null,null,null,null,null,null,9,{"$f":"AM16+1","v":13},"","",{"$error":"#VALUE!"},{"$error":"#VALUE!"},{"$error":"#VALUE!"},15000,"Fill in supplementary fields","Fill in supplementary fields",40000,15000,15000,15000,15000,15000,15000,15000,15000,"12=Porfolio mobilisation, risk transfer through securitisation (PILOT)",{"$f":"VALUE(LEFT(BE17,FIND(\"=\",BE17)-1))","v":12}]
[null,null,null,null,null,null,null,null,null,null,null,null,null,null,null,null,null,null,"",null,null,null,null,null,null,null,null,null,null,null,null,null,null,null,null,null,null,"",14,"Fill in supplementary fields","Fill in supplementary fields",{"$f":"IF(V18>W18,\"B cannot be higher than C\",IF(COUNTA(AA18:AB18)=0,\"Fill in supplementary fields\",(X18/2)*(V18/W18)+(X18/2)*(1/SUM(AA18:AB18))))+(IF(LEFT(T18,1)=\"1\",((V30*AD30)*(AE30/(1-AE30))),IF(LEFT(T18,1)=\"2\",IF(COUNTA(V18:X18)=0,\"Fill in supplementary fields\",(W18+X18)*AE18*AD18))))","v":{"$error":"#VALUE!"}},{"$f":"IF(V18>W18,\"B cannot be higher than C\",IFERROR(IF(COUNTA(AA18:AB18)=0,\"Fill in supplementary fields\",X18/2)*(V18/W18)+(X18/2)*(1/AA18),\"Fill in supplementary fields\"))+(IF(LEFT(T18,1)=\"1\",((V30*AD30)*(AE30/(1-AE30))),IF(LEFT(T18,1)=\"2\",IF(COUNTA(V18:X18)=0,\"Fill in supplementary fields\",(W18+X18)*AE18*AD18))))","v":{"$error":"#VALUE!"}},{"$f":"IF(V18>W18,\"B cannot be higher than C\",IFERROR(IF(COUNTA(AA18:AB18)=0,\"Fill in supplementary fields\",IF(AA18=0,X18/2*(V18/W18)+X18/2*(1/AB18),(X18/2)*(V18/W18))),\"Fill in supplementary fields\"))+(IF(LEFT(T18,1)=\"1\",((V30*AD30)*(AE30/(1-AE30))),IF(LEFT(T18,1)=\"2\",IF(COUNTA(V18:X18)=0,\"Fill in supplementary fields\",(W18+X18)*AE18*AD18))))","v":{"$error":"#VALUE!"}},"Enter exposure values in fields A and B","Fill in supplementary fields","Fill in supplementary fields","Fill in supplementary fields","Fill in supplementary fields",0,0,0,0,0,0,0,"13=Portfolio mobilisation, risk transfer through portfolio insurance (PILOT)",13]
[null,null,null,null,null,null,null,null,null,null,null,null,null,null,null,null,null,null,"",null,null,null,null,null,null,null,null,null,null,null,null,null,null,null,null,null,null,"",15,"Fill in supplementary fields","Fill in supplementary fields",{"$f":"IF(V19>W19,\"B cannot be higher than C\",IF(COUNTA(AA19:AB19)=0,\"Fill in supplementary fields\",(X19/2)*(V19/W19)+(X19/2)*(1/SUM(AA19:AB19))))+(IF(LEFT(T19,1)=\"1\",((W19+X19)/AC19)*(V19/(W19+X19))*AD19*AE19*(AC19/(1-AE19)),IF(LEFT(T19,1)=\"2\",IF(COUNTA(V19:X19)=0,\"Fill in supplementary fields\",(W19+X19)*AE19*AD19))))","v":{"$error":"#VALUE!"}},{"$f":"IF(V19>W19,\"B cannot be higher than C\",IFERROR(IF(COUNTA(AA19:AB19)=0,\"Fill in supplementary fields\",X19/2)*(V19/W19)+(X19/2)*(1/AA19),\"Fill in supplementary fields\"))+(IF(LEFT(T19,1)=\"1\",((W19+X19)/AC19)*(V19/(W19+X19))*AD19*AE19*(AC19/(1-AE19)),IF(LEFT(T19,1)=\"2\",IF(COUNTA(V19:X19)=0,\"Fill in supplementary fields\",(W19+X19)*AE19*AD19))))","v":{"$error":"#VALUE!"}},{"$f":"IF(V19>W19,\"B cannot be higher than C\",IFERROR(IF(COUNTA(AA19:AB19)=0,\"Fill in supplementary fields\",IF(AA19=0,X19/2*(V19/W19)+X19/2*(1/AB19),(X19/2)*(V19/W19))),\"Fill in supplementary fields\"))+(IF(LEFT(T19,1)=\"1\",((W19+X19)/AC19)*(V19/(W19+X19))*AD19*AE19*(AC19/(1-AE19)),IF(LEFT(T19,1)=\"2\",IF(COUNTA(V19:X19)=0,\"Fill in supplementary fields\",(W19+X19)*AE19*AD19))))","v":{"$error":"#VALUE!"}},"Enter exposure values in fields A and B","Fill in supplementary fields","Fill in supplementary fields","Fill in supplementary fields","Fill in supplementary fields",0,0,0,0,0,0,0,"14=Generation, equity (PILOT) ",14]
[null,null,null,null,null,null,null,null,null,null,null,null,null,null,null,null,null,null,"",null,null,null,null,null,null,"",null,null,null,null,null,null,null,null,null,null,null,"",16,"Fill in supplementary fields","Fill in supplementary fields",{"$error":"#VALUE!"},{"$error":"#VALUE!"},{"$error":"#VALUE!"},"Enter exposure values in fields A and B","Fill in supplementary fields","Fill in supplementary fields","Fill in supplementary fields","Fill in supplementary fields",0,0,0,0,0,0,0,"15=Generation, hybrid capital (PILOT)",15]
[null,null,null,null,null,null,null,null,null,null,null,null,null,null,null,null,null,null,"",null,null,null,null,null,null,"",null,null,null,null,null,null,null,null,null,null,null,"",17,"Fill in supplementary fields","Fill in supplementary fields",{"$f":"IF(V21>W21,\"B cannot be higher than C\",IF(COUNTA(AA21:AB21)=0,\"Fill in supplementary fields\",(X21/2)*(V21/W21)+(X21/2)*(1/SUM(AA21:AB21))))+(IF(LEFT(T21,1)=\"1\",((V33*AD33)*(AE33/(1-AE33))),IF(LEFT(T21,1)=\"2\",IF(COUNTA(V21:X21)=0,\"Fill in supplementary fields\",(W21+X21)*AE21*AD21))))","v":{"$error":"#VALUE!"}},{"$f":"IF(V21>W21,\"B cannot be higher than C\",IFERROR(IF(COUNTA(AA21:AB21)=0,\"Fill in supplementary fields\",X21/2)*(V21/W21)+(X21/2)*(1/AA21),\"Fill in supplementary fields\"))+(IF(LEFT(T21,1)=\"1\",((V33*AD33)*(AE33/(1-AE33))),IF(LEFT(T21,1)=\"2\",IF(COUNTA(V21:X21)=0,\"Fill in supplementary fields\",(W21+X21)*AE21*AD21))))","v":{"$error":"#VALUE!"}},{"$f":"IF(V21>W21,\"B cannot be higher than C\",IFERROR(IF(COUNTA(AA21:AB21)=0,\"Fill in supplementary fields\",IF(AA21=0,X21/2*(V21/W21)+X21/2*(1/AB21),(X21/2)*(V21/W21))),\"Fill in supplementary fields\"))+(IF(LEFT(T21,1)=\"1\",((V33*AD33)*(AE33/(1-AE33))),IF(LEFT(T21,1)=\"2\",IF(COUNTA(V21:X21)=0,\"Fill in supplementary fields\",(W21+X21)*AE21*AD21))))","v":{"$error":"#VALUE!"}},"Enter exposure values in fields A and B","Fill in supplementary fields","Fill in supplementary fields","Fill in supplementary fields","Fill in supplementary fields",0,0,0,0,0,0,0,"16=Generation, bond issuance (PILOT)",16]
[null,null,null,null,null,null,null,null,null,null,null,null,null,null,null,null,null,null,"",null,null,null,null,null,null,"",null,null,null,null,null,null,null,null,null,null,null,"",18,"Fill in supplementary fields","Fill in supplementary fields",{"$f":"IF(V22>W22,\"B cannot be higher than C\",IF(COUNTA(AA22:AB22)=0,\"Fill in supplementary fields\",(X22/2)*(V22/W22)+(X22/2)*(1/SUM(AA22:AB22))))+(IF(LEFT(T22,1)=\"1\",((W22+X22)/AC22)*(V22/(W22+X22))*AD22*AE22*(AC22/(1-AE22)),IF(LEFT(T22,1)=\"2\",IF(COUNTA(V22:X22)=0,\"Fill in supplementary fields\",(W22+X22)*AE22*AD22))))","v":{"$error":"#VALUE!"}},{"$f":"IF(V22>W22,\"B cannot be higher than C\",IFERROR(IF(COUNTA(AA22:AB22)=0,\"Fill in supplementary fields\",X22/2)*(V22/W22)+(X22/2)*(1/AA22),\"Fill in supplementary fields\"))+(IF(LEFT(T22,1)=\"1\",((W22+X22)/AC22)*(V22/(W22+X22))*AD22*AE22*(AC22/(1-AE22)),IF(LEFT(T22,1)=\"2\",IF(COUNTA(V22:X22)=0,\"Fill in supplementary fields\",(W22+X22)*AE22*AD22))))","v":{"$error":"#VALUE!"}},{"$f":"IF(V22>W22,\"B cannot be higher than C\",IFERROR(IF(COUNTA(AA22:AB22)=0,\"Fill in supplementary fields\",IF(AA22=0,X22/2*(V22/W22)+X22/2*(1/AB22),(X22/2)*(V22/W22))),\"Fill in supplementary fields\"))+(IF(LEFT(T22,1)=\"1\",((W22+X22)/AC22)*(V22/(W22+X22))*AD22*AE22*(AC22/(1-AE22)),IF(LEFT(T22,1)=\"2\",IF(COUNTA(V22:X22)=0,\"Fill in supplementary fields\",(W22+X22)*AE22*AD22))))","v":{"$error":"#VALUE!"}},"Enter exposure values in fields A and B","Fill in supplementary fields","Fill in supplementary fields","Fill in supplementary fields","Fill in supplementary fields",{"$f":"$X22","v":0},0,0,0,0,0,0]
[null,null,null,null,null,null,null,null,null,null,null,null,null,null,null,null,null,null,"",null,null,null,null,null,null,"",null,null,null,null,null,null,null,null,null,null,null,"",19,"Fill in supplementary fields","Fill in supplementary fields",{"$error":"#VALUE!"},{"$error":"#VALUE!"},{"$error":"#VALUE!"},"Enter exposure values in fields A and B","Fill in supplementary fields","Fill in supplementary fields","Fill in supplementary fields","Fill in supplementary fields",0,0,0,0,0,0,0]
[null,null,null,null,null,null,null,null,null,null,null,null,null,null,null,null,null,null,"",null,null,null,null,null,null,"",null,null,null,null,null,null,null,null,null,null,null,"",20,"Fill in supplementary fields","Fill in supplementary fields",{"$f":"IF(V24>W24,\"B cannot be higher than C\",IF(COUNTA(AA24:AB24)=0,\"Fill in supplementary fields\",(X24/2)*(V24/W24)+(X24/2)*(1/SUM(AA24:AB24))))+(IF(LEFT(T24,1)=\"1\",((V36*AD36)*(AE36/(1-AE36))),IF(LEFT(T24,1)=\"2\",IF(COUNTA(V24:X24)=0,\"Fill in supplementary fields\",(W24+X24)*AE24*AD24))))","v":{"$error":"#VALUE!"}},{"$f":"IF(V24>W24,\"B cannot be higher than C\",IFERROR(IF(COUNTA(AA24:AB24)=0,\"Fill in supplementary fields\",X24/2)*(V24/W24)+(X24/2)*(1/AA24),\"Fill in supplementary fields\"))+(IF(LEFT(T24,1)=\"1\",((V36*AD36)*(AE36/(1-AE36))),IF(LEFT(T24,1)=\"2\",IF(COUNTA(V24:X24)=0,\"Fill in supplementary fields\",(W24+X24)*AE24*AD24))))","v":{"$error":"#VALUE!"}},{"$f":"IF(V24>W24,\"B cannot be higher than C\",IFERROR(IF(COUNTA(AA24:AB24)=0,\"Fill in supplementary fields\",IF(AA24=0,X24/2*(V24/W24)+X24/2*(1/AB24),(X24/2)*(V24/W24))),\"Fill in supplementary fields\"))+(IF(LEFT(T24,1)=\"1\",((V36*AD36)*(AE36/(1-AE36))),IF(LEFT(T24,1)=\"2\",IF(COUNTA(V24:X24)=0,\"Fill in supplementary fields\",(W24+X24)*AE24*AD24))))","v":{"$error":"#VALUE!"}},"Enter exposure values in fields A and B","Fill in supplementary fields","Fill in supplementary fields","Fill in supplementary fields","Fill in supplementary fields",0,0,0,0,0,0,0]
[null,null,null,null,null,null,null,null,null,null,null,null,null,null,null,null,null,null,"",null,null,null,null,null,null,"",null,null,null,null,null,null,null,null,null,null,null,"",21,"Fill in supplementary fields","Fill in supplementary fields",{"$f":"IF(V25>W25,\"B cannot be higher than C\",IF(COUNTA(AA25:AB25)=0,\"Fill in supplementary fields\",(X25/2)*(V25/W25)+(X25/2)*(1/SUM(AA25:AB25))))+(IF(LEFT(T25,1)=\"1\",((W25+X25)/AC25)*(V25/(W25+X25))*AD25*AE25*(AC25/(1-AE25)),IF(LEFT(T25,1)=\"2\",IF(COUNTA(V25:X25)=0,\"Fill in supplementary fields\",(W25+X25)*AE25*AD25))))","v":{"$error":"#VALUE!"}},{"$f":"IF(V25>W25,\"B cannot be higher than C\",IFERROR(IF(COUNTA(AA25:AB25)=0,\"Fill in supplementary fields\",X25/2)*(V25/W25)+(X25/2)*(1/AA25),\"Fill in supplementary fields\"))+(IF(LEFT(T25,1)=\"1\",((W25+X25)/AC25)*(V25/(W25+X25))*AD25*AE25*(AC25/(1-AE25)),IF(LEFT(T25,1)=\"2\",IF(COUNTA(V25:X25)=0,\"Fill in supplementary fields\",(W25+X25)*AE25*AD25))))","v":{"$error":"#VALUE!"}},{"$f":"IF(V25>W25,\"B cannot be higher than C\",IFERROR(IF(COUNTA(AA25:AB25)=0,\"Fill in supplementary fields\",IF(AA25=0,X25/2*(V25/W25)+X25/2*(1/AB25),(X25/2)*(V25/W25))),\"Fill in supplementary fields\"))+(IF(LEFT(T25,1)=\"1\",((W25+X25)/AC25)*(V25/(W25+X25))*AD25*AE25*(AC25/(1-AE25)),IF(LEFT(T25,1)=\"2\",IF(COUNTA(V25:X25)=0,\"Fill in supplementary fields\",(W25+X25)*AE25*AD25))))","v":{"$error":"#VALUE!"}},"Enter exposure values in fields A and B","Fill in supplementary fields","Fill in supplementary fields","Fill in supplementary fields","Fill in supplementary fields",0,0,0,0,0,0,0]
[null,null,null,null,null,null,null,null,null,null,null,null,null,null,null,null,null,null,"",null,null,null,null,null,null,"",null,null,null,null,null,null,null,null,null,null,null,"",22,"Fill in supplementary fields","Fill in supplementary fields",{"$error":"#VALUE!"},{"$error":"#VALUE!"},{"$error":"#VALUE!"},"Enter exposure values in fields A and B","Fill in supplementary fields","Fill in supplementary fields","Fill in supplementary fields","Fill in supplementary fields",0,0,0,0,0,0,0]
[null,null,null,null,null,null,null,null,null,null,null,null,null,null,null,null,null,null,"",null,null,null,null,null,null,"",null,null,null,null,null,null,null,null,null,null,null,"",23,"Fill in supplementary fields","Fill in supplementary fields",{"$f":"IF(V27>W27,\"B cannot be higher than C\",IF(COUNTA(AA27:AB27)=0,\"Fill in supplementary fields\",(X27/2)*(V27/W27)+(X27/2)*(1/SUM(AA27:AB27))))+(IF(LEFT(T27,1)=\"1\",((V39*AD39)*(AE39/(1-AE39))),IF(LEFT(T27,1)=\"2\",IF(COUNTA(V27:X27)=0,\"Fill in supplementary fields\",(W27+X27)*AE27*AD27))))","v":{"$error":"#VALUE!"}},{"$f":"IF(V27>W27,\"B cannot be higher than C\",IFERROR(IF(COUNTA(AA27:AB27)=0,\"Fill in supplementary fields\",X27/2)*(V27/W27)+(X27/2)*(1/AA27),\"Fill in supplementary fields\"))+(IF(LEFT(T27,1)=\"1\",((V39*AD39)*(AE39/(1-AE39))),IF(LEFT(T27,1)=\"2\",IF(COUNTA(V27:X27)=0,\"Fill in supplementary fields\",(W27+X27)*AE27*AD27))))","v":{"$error":"#VALUE!"}},{"$f":"IF(V27>W27,\"B cannot be higher than C\",IFERROR(IF(COUNTA(AA27:AB27)=0,\"Fill in supplementary fields\",IF(AA27=0,X27/2*(V27/W27)+X27/2*(1/AB27),(X27/2)*(V27/W27))),\"Fill in supplementary fields\"))+(IF(LEFT(T27,1)=\"1\",((V39*AD39)*(AE39/(1-AE39))),IF(LEFT(T27,1)=\"2\",IF(COUNTA(V27:X27)=0,\"Fill in supplementary fields\",(W27+X27)*AE27*AD27))))","v":{"$error":"#VALUE!"}},"Enter exposure values in fields A and B","Fill in supplementary fields","Fill in supplementary fields","Fill in supplementary fields","Fill in supplementary fields",0,0,0,0,0,0,0]
[null,null,null,null,null,null,null,null,null,null,null,null,null,null,null,null,null,null,"",null,null,null,null,null,null,"",null,null,null,null,null,null,null,null,null,null,null,"",24,"Fill in supplementary fields","Fill in supplementary fields",{"$f":"IF(V28>W28,\"B cannot be higher than C\",IF(COUNTA(AA28:AB28)=0,\"Fill in supplementary fields\",(X28/2)*(V28/W28)+(X28/2)*(1/SUM(AA28:AB28))))+(IF(LEFT(T28,1)=\"1\",((W28+X28)/AC28)*(V28/(W28+X28))*AD28*AE28*(AC28/(1-AE28)),IF(LEFT(T28,1)=\"2\",IF(COUNTA(V28:X28)=0,\"Fill in supplementary fields\",(W28+X28)*AE28*AD28))))","v":{"$error":"#VALUE!"}},{"$f":"IF(V28>W28,\"B cannot be higher than C\",IFERROR(IF(COUNTA(AA28:AB28)=0,\"Fill in supplementary fields\",X28/2)*(V28/W28)+(X28/2)*(1/AA28),\"Fill in supplementary fields\"))+(IF(LEFT(T28,1)=\"1\",((W28+X28)/AC28)*(V28/(W28+X28))*AD28*AE28*(AC28/(1-AE28)),IF(LEFT(T28,1)=\"2\",IF(COUNTA(V28:X28)=0,\"Fill in supplementary fields\",(W28+X28)*AE28*AD28))))","v":{"$error":"#VALUE!"}},{"$f":"IF(V28>W28,\"B cannot be higher than C\",IFERROR(IF(COUNTA(AA28:AB28)=0,\"Fill in supplementary fields\",IF(AA28=0,X28/2*(V28/W28)+X28/2*(1/AB28),(X28/2)*(V28/W28))),\"Fill in supplementary fields\"))+(IF(LEFT(T28,1)=\"1\",((W28+X28)/AC28)*(V28/(W28+X28))*AD28*AE28*(AC28/(1-AE28)),IF(LEFT(T28,1)=\"2\",IF(COUNTA(V28:X28)=0,\"Fill in supplementary fields\",(W28+X28)*AE28*AD28))))","v":{"$error":"#VALUE!"}},"Enter exposure values in fields A and B","Fill in supplementary fields","Fill in supplementary fields","Fill in supplementary fields","Fill in supplementary fields",0,0,0,0,0,0,0]
[null,null,null,null,null,null,null,null,null,null,null,null,null,null,null,null,null,null,"",null,null,null,null,null,null,"",null,null,null,null,null,null,null,null,null,null,null,"",25,"Fill in supplementary fields","Fill in supplementary fields",{"$error":"#VALUE!"},{"$error":"#VALUE!"},{"$error":"#VALUE!"},"Enter exposure values in fields A and B","Fill in supplementary fields","Fill in supplementary fields","Fill in supplementary fields","Fill in supplementary fields",0,0,0,0,0,0,0]
[null,null,null,null,null,null,null,null,null,null,null,null,null,null,null,null,null,null,"",null,null,null,null,null,null,"",null,null,null,null,null,null,null,null,null,null,null,"",26,"Fill in supplementary fields","Fill in supplementary fields",{"$f":"IF(V30>W30,\"B cannot be higher than C\",IF(COUNTA(AA30:AB30)=0,\"Fill in supplementary fields\",(X30/2)*(V30/W30)+(X30/2)*(1/SUM(AA30:AB30))))+(IF(LEFT(T30,1)=\"1\",((V42*AD42)*(AE42/(1-AE42))),IF(LEFT(T30,1)=\"2\",IF(COUNTA(V30:X30)=0,\"Fill in supplementary fields\",(W30+X30)*AE30*AD30))))","v":{"$error":"#VALUE!"}},{"$f":"IF(V30>W30,\"B cannot be higher than C\",IFERROR(IF(COUNTA(AA30:AB30)=0,\"Fill in supplementary fields\",X30/2)*(V30/W30)+(X30/2)*(1/AA30),\"Fill in supplementary fields\"))+(IF(LEFT(T30,1)=\"1\",((V42*AD42)*(AE42/(1-AE42))),IF(LEFT(T30,1)=\"2\",IF(COUNTA(V30:X30)=0,\"Fill in supplementary fields\",(W30+X30)*AE30*AD30))))","v":{"$error":"#VALUE!"}},{"$f":"IF(V30>W30,\"B cannot be higher than C\",IFERROR(IF(COUNTA(AA30:AB30)=0,\"Fill in supplementary fields\",IF(AA30=0,X30/2*(V30/W30)+X30/2*(1/AB30),(X30/2)*(V30/W30))),\"Fill in supplementary fields\"))+(IF(LEFT(T30,1)=\"1\",((V42*AD42)*(AE42/(1-AE42))),IF(LEFT(T30,1)=\"2\",IF(COUNTA(V30:X30)=0,\"Fill in supplementary fields\",(W30+X30)*AE30*AD30))))","v":{"$error":"#VALUE!"}},"Enter exposure values in fields A and B","Fill in supplementary fields","Fill in supplementary fields","Fill in supplementary fields","Fill in supplementary fields",0,0,0,0,0,0,0]
[null,null,null,null,null,null,null,null,null,null,null,null,null,null,null,null,null,null,"",null,null,null,null,null,null,"",null,null,null,null,null,null,null,null,null,null,null,"",27,"Fill in supplementary fields","Fill in supplementary fields",{"$f":"IF(V31>W31,\"B cannot be higher than C\",IF(COUNTA(AA31:AB31)=0,\"Fill in supplementary fields\",(X31/2)*(V31/W31)+(X31/2)*(1/SUM(AA31:AB31))))+(IF(LEFT(T31,1)=\"1\",((W31+X31)/AC31)*(V31/(W31+X31))*AD31*AE31*(AC31/(1-AE31)),IF(LEFT(T31,1)=\"2\",IF(COUNTA(V31:X31)=0,\"Fill in supplementary fields\",(W31+X31)*AE31*AD31))))","v":{"$error":"#VALUE!"}},{"$f":"IF(V31>W31,\"B cannot be higher than C\",IFERROR(IF(COUNTA(AA31:AB31)=0,\"Fill in supplementary fields\",X31/2)*(V31/W31)+(X31/2)*(1/AA31),\"Fill in supplementary fields\"))+(IF(LEFT(T31,1)=\"1\",((W31+X31)/AC31)*(V31/(W31+X31))*AD31*AE31*(AC31/(1-AE31)),IF(LEFT(T31,1)=\"2\",IF(COUNTA(V31:X31)=0,\"Fill in supplementary fields\",(W31+X31)*AE31*AD31))))","v":{"$error":"#VALUE!"}},{"$f":"IF(V31>W31,\"B cannot be higher than C\",IFERROR(IF(COUNTA(AA31:AB31)=0,\"Fill in supplementary fields\",IF(AA31=0,X31/2*(V31/W31)+X31/2*(1/AB31),(X31/2)*(V31/W31))),\"Fill in supplementary fields\"))+(IF(LEFT(T31,1)=\"1\",((W31+X31)/AC31)*(V31/(W31+X31))*AD31*AE31*(AC31/(1-AE31)),IF(LEFT(T31,1)=\"2\",IF(COUNTA(V31:X31)=0,\"Fill in supplementary fields\",(W31+X31)*AE31*AD31))))","v":{"$error":"#VALUE!"}},"Enter exposure values in fields A and B","Fill in supplementary fields","Fill in supplementary fields","Fill in supplementary fields","Fill in supplementary fields",0,0,0,0,0,0,0]
[null,null,null,null,null,null,null,null,null,null,null,null,null,null,null,null,null,null,"",null,null,null,null,null,null,"",null,null,null,null,null,null,null,null,null,null,null,"",28,"Fill in supplementary fields","Fill in supplementary fields",{"$error":"#VALUE!"},{"$error":"#VALUE!"},{"$error":"#VALUE!"},"Enter exposure values in fields A and B","Fill in supplementary fields","Fill in supplementary fields","Fill in supplementary fields","Fill in supplementary fields",0,0,0,0,0,0,0]
[null,null,null,null,null,null,null,null,null,null,null,null,null,null,null,null,null,null,"",null,null,null,null,null,null,"",null,null,null,null,null,null,null,null,null,null,null,"",29,"Fill in supplementary fields","Fill in supplementary fields",{"$f":"IF(V33>W33,\"B cannot be higher than C\",IF(COUNTA(AA33:AB33)=0,\"Fill in supplementary fields\",(X33/2)*(V33/W33)+(X33/2)*(1/SUM(AA33:AB33))))+(IF(LEFT(T33,1)=\"1\",((V45*AD45)*(AE45/(1-AE45))),IF(LEFT(T33,1)=\"2\",IF(COUNTA(V33:X33)=0,\"Fill in supplementary fields\",(W33+X33)*AE33*AD33))))","v":{"$error":"#VALUE!"}},{"$f":"IF(V33>W33,\"B cannot be higher than C\",IFERROR(IF(COUNTA(AA33:AB33)=0,\"Fill in supplementary fields\",X33/2)*(V33/W33)+(X33/2)*(1/AA33),\"Fill in supplementary fields\"))+(IF(LEFT(T33,1)=\"1\",((V45*AD45)*(AE45/(1-AE45))),IF(LEFT(T33,1)=\"2\",IF(COUNTA(V33:X33)=0,\"Fill in supplementary fields\",(W33+X33)*AE33*AD33))))","v":{"$error":"#VALUE!"}},{"$f":"IF(V33>W33,\"B cannot be higher than C\",IFERROR(IF(COUNTA(AA33:AB33)=0,\"Fill in supplementary fields\",IF(AA33=0,X33/2*(V33/W33)+X33/2*(1/AB33),(X33/2)*(V33/W33))),\"Fill in supplementary fields\"))+(IF(LEFT(T33,1)=\"1\",((V45*AD45)*(AE45/(1-AE45))),IF(LEFT(T33,1)=\"2\",IF(COUNTA(V33:X33)=0,\"Fill in supplementary fields\",(W33+X33)*AE33*AD33))))","v":{"$error":"#VALUE!"}},"Enter exposure values in fields A and B","Fill in supplementary fields","Fill in supplementary fields","Fill in supplementary fields","Fill in supplementary fields",0,0,0,0,0,0,0]
[null,null,null,null,null,null,null,null,null,null,null,null,null,null,null,null,null,null,"",null,null,null,null,null,null,"",null,null,null,null,null,null,null,null,null,null,null,"",30,"Fill in supplementary fields","Fill in supplementary fields",{"$f":"IF(V34>W34,\"B cannot be higher than C\",IF(COUNTA(AA34:AB34)=0,\"Fill in supplementary fields\",(X34/2)*(V34/W34)+(X34/2)*(1/SUM(AA34:AB34))))+(IF(LEFT(T34,1)=\"1\",((W34+X34)/AC34)*(V34/(W34+X34))*AD34*AE34*(AC34/(1-AE34)),IF(LEFT(T34,1)=\"2\",IF(COUNTA(V34:X34)=0,\"Fill in supplementary fields\",(W34+X34)*AE34*AD34))))","v":{"$error":"#VALUE!"}},{"$f":"IF(V34>W34,\"B cannot be higher than C\",IFERROR(IF(COUNTA(AA34:AB34)=0,\"Fill in supplementary fields\",X34/2)*(V34/W34)+(X34/2)*(1/AA34),\"Fill in supplementary fields\"))+(IF(LEFT(T34,1)=\"1\",((W34+X34)/AC34)*(V34/(W34+X34))*AD34*AE34*(AC34/(1-AE34)),IF(LEFT(T34,1)=\"2\",IF(COUNTA(V34:X34)=0,\"Fill in supplementary fields\",(W34+X34)*AE34*AD34))))","v":{"$error":"#VALUE!"}},{"$f":"IF(V34>W34,\"B cannot be higher than C\",IFERROR(IF(COUNTA(AA34:AB34)=0,\"Fill in supplementary fields\",IF(AA34=0,X34/2*(V34/W34)+X34/2*(1/AB34),(X34/2)*(V34/W34))),\"Fill in supplementary fields\"))+(IF(LEFT(T34,1)=\"1\",((W34+X34)/AC34)*(V34/(W34+X34))*AD34*AE34*(AC34/(1-AE34)),IF(LEFT(T34,1)=\"2\",IF(COUNTA(V34:X34)=0,\"Fill in supplementary fields\",(W34+X34)*AE34*AD34))))","v":{"$error":"#VALUE!"}},"Enter exposure values in fields A and B","Fill in supplementary fields","Fill in supplementary fields","Fill in supplementary fields","Fill in supplementary fields",0,0,0,0,0,0,0]
[null,null,null,null,null,null,null,null,null,null,null,null,null,null,null,null,null,null,"",null,null,null,null,null,null,"",null,null,null,null,null,null,null,null,null,null,null,"",31,"Fill in supplementary fields","Fill in supplementary fields",{"$error":"#VALUE!"},{"$error":"#VALUE!"},{"$error":"#VALUE!"},"Enter exposure values in fields A and B","Fill in supplementary fields","Fill in supplementary fields","Fill in supplementary fields","Fill in supplementary fields",0,0,0,0,0,0,0]
[null,null,null,null,null,null,null,null,null,null,null,null,null,null,null,null,null,null,"",null,null,null,null,null,null,"",null,null,null,null,null,null,null,null,null,null,null,"",32,"Fill in supplementary fields","Fill in supplementary fields",{"$f":"IF(V36>W36,\"B cannot be higher than C\",IF(COUNTA(AA36:AB36)=0,\"Fill in supplementary fields\",(X36/2)*(V36/W36)+(X36/2)*(1/SUM(AA36:AB36))))+(IF(LEFT(T36,1)=\"1\",((V48*AD48)*(AE48/(1-AE48))),IF(LEFT(T36,1)=\"2\",IF(COUNTA(V36:X36)=0,\"Fill in supplementary fields\",(W36+X36)*AE36*AD36))))","v":{"$error":"#VALUE!"}},{"$f":"IF(V36>W36,\"B cannot be higher than C\",IFERROR(IF(COUNTA(AA36:AB36)=0,\"Fill in supplementary fields\",X36/2)*(V36/W36)+(X36/2)*(1/AA36),\"Fill in supplementary fields\"))+(IF(LEFT(T36,1)=\"1\",((V48*AD48)*(AE48/(1-AE48))),IF(LEFT(T36,1)=\"2\",IF(COUNTA(V36:X36)=0,\"Fill in supplementary fields\",(W36+X36)*AE36*AD36))))","v":{"$error":"#VALUE!"}},{"$f":"IF(V36>W36,\"B cannot be higher than C\",IFERROR(IF(COUNTA(AA36:AB36)=0,\"Fill in supplementary fields\",IF(AA36=0,X36/2*(V36/W36)+X36/2*(1/AB36),(X36/2)*(V36/W36))),\"Fill in supplementary fields\"))+(IF(LEFT(T36,1)=\"1\",((V48*AD48)*(AE48/(1-AE48))),IF(LEFT(T36,1)=\"2\",IF(COUNTA(V36:X36)=0,\"Fill in supplementary fields\",(W36+X36)*AE36*AD36))))","v":{"$error":"#VALUE!"}},"Enter exposure values in fields A and B","Fill in supplementary fields","Fill in supplementary fields","Fill in supplementary fields","Fill in supplementary fields",0,0,0,0,0,0,0]
[null,null,null,null,null,null,null,null,null,null,null,null,null,null,null,null,null,null,"",null,null,null,null,null,null,"",null,null,null,null,null,null,null,null,null,null,null,"",33,"Fill in supplementary fields","Fill in supplementary fields",{"$f":"IF(V37>W37,\"B cannot be higher than C\",IF(COUNTA(AA37:AB37)=0,\"Fill in supplementary fields\",(X37/2)*(V37/W37)+(X37/2)*(1/SUM(AA37:AB37))))+(IF(LEFT(T37,1)=\"1\",((W37+X37)/AC37)*(V37/(W37+X37))*AD37*AE37*(AC37/(1-AE37)),IF(LEFT(T37,1)=\"2\",IF(COUNTA(V37:X37)=0,\"Fill in supplementary fields\",(W37+X37)*AE37*AD37))))","v":{"$error":"#VALUE!"}},{"$f":"IF(V37>W37,\"B cannot be higher than C\",IFERROR(IF(COUNTA(AA37:AB37)=0,\"Fill in supplementary fields\",X37/2)*(V37/W37)+(X37/2)*(1/AA37),\"Fill in supplementary fields\"))+(IF(LEFT(T37,1)=\"1\",((W37+X37)/AC37)*(V37/(W37+X37))*AD37*AE37*(AC37/(1-AE37)),IF(LEFT(T37,1)=\"2\",IF(COUNTA(V37:X37)=0,\"Fill in supplementary fields\",(W37+X37)*AE37*AD37))))","v":{"$error":"#VALUE!"}},{"$f":"IF(V37>W37,\"B cannot be higher than C\",IFERROR(IF(COUNTA(AA37:AB37)=0,\"Fill in supplementary fields\",IF(AA37=0,X37/2*(V37/W37)+X37/2*(1/AB37),(X37/2)*(V37/W37))),\"Fill in supplementary fields\"))+(IF(LEFT(T37,1)=\"1\",((W37+X37)/AC37)*(V37/(W37+X37))*AD37*AE37*(AC37/(1-AE37)),IF(LEFT(T37,1)=\"2\",IF(COUNTA(V37:X37)=0,\"Fill in supplementary fields\",(W37+X37)*AE37*AD37))))","v":{"$error":"#VALUE!"}},"Enter exposure values in fields A and B","Fill in supplementary fields","Fill in supplementary fields","Fill in supplementary fields","Fill in supplementary fields",0,0,0,0,0,0,0]
[null,null,null,null,null,null,null,null,null,null,null,null,null,null,null,null,null,null,{"$f":"IF(LEN(Q38)=0,\"\",HLOOKUP(AL38,$AN$5:$BC$200,AM38,FALSE))","v":""},null,null,null,null,null,null,"",null,null,null,null,null,null,null,null,null,null,null,{"$f":"IFERROR(VLOOKUP(Q38,BE:BF,2,FALSE),\"\")","v":""},34,{"$f":"IF(V38>W38,\"B cannot be higher than C\",IF(COUNTA(V38:X38)=0,\"Fill in supplementary fields\",IFERROR(IF(VALUE(LEFT(Z38,1))=1,X38/2+(V38/W38)*(X38/2),IF(VALUE(LEFT(Z38,1))=2,\"impossible combination\",\"check not available\")),\"\")))","v":"Fill in supplementary fields"},{"$f":"IF(V38>W38,\"B cannot be higher than C\",IF(COUNTA(V38:X38)=0,\"Fill in supplementary fields\",IFERROR(IF(VALUE(LEFT(Z38,1))=1,(V38/W38)*(X38/2),IF(VALUE(LEFT(Z38,1))=2,(V38/W38)*(X38),\"check not available\")),\"\")))","v":"Fill in supplementary fields"},{"$error":"#VALUE!"},{"$error":"#VALUE!"},{"$error":"#VALUE!"},{"$f":"IF(V38>W38,\"B cannot be higher than C\",IF(COUNTA(V38:X38)=0,\"Enter exposure values in fields A and B\",(X38)*(V38/W38)))","v":"Enter exposure values in fields A and B"},{"$f":"IF(V38>W38,\"B cannot be higher than C\",IFERROR(IF(COUNTA(AA38:AB38)=0,\"Fill in supplementary fields\",X38/2)*(V38/W38)+(X38/2)*(1/AA38),\"Fill in supplementary fields\"))","v":"Fill in supplementary fields"},{"$f":"IF(V38>W38,\"B cannot be higher than C\",IFERROR(IF(COUNTA(AA38:AB38)=0,\"Fill in supplementary fields\",IF(AA38=0,X38/2*(V38/W38)+X38/2*(1/AB38),(X38/2)*(V38/W38))),\"Fill in supplementary fields\"))","v":"Fill in supplementary fields"},{"$f":"IF(V38>W38,\"B cannot be higher than C\",IF(COUNTA(V38:X38)=0,\"Fill in supplementary fields\",(V38/W38)*((X38)+AD38*AE38)))","v":"Fill in supplementary fields"},{"$f":"IF(V38>W38,\"B cannot be higher than C\",IF(COUNTA(V38:X38)=0,\"Fill in supplementary fields\",(X38)*(V38/W38)))","v":"Fill in supplementary fields"},{"$f":"$X38","v":0},0,0,0,0,0,0]
[null,null,null,null,null,null,null,null,null,null,null,null,null,null,null,null,null,null,"",null,null,null,null,null,null,"",null,null,null,null,null,null,null,null,null,null,null,"",35,"Fill in supplementary fields","Fill in supplementary fields",{"$f":"IF(V39>W39,\"B cannot be higher than C\",IF(COUNTA(AA39:AB39)=0,\"Fill in supplementary fields\",(X39/2)*(V39/W39)+(X39/2)*(1/SUM(AA39:AB39))))+(IF(LEFT(T39,1)=\"1\",((V51*AD51)*(AE51/(1-AE51))),IF(LEFT(T39,1)=\"2\",IF(COUNTA(V39:X39)=0,\"Fill in supplementary fields\",(W39+X39)*AE39*AD39))))","v":{"$error":"#VALUE!"}},{"$f":"IF(V39>W39,\"B cannot be higher than C\",IFERROR(IF(COUNTA(AA39:AB39)=0,\"Fill in supplementary fields\",X39/2)*(V39/W39)+(X39/2)*(1/AA39),\"Fill in supplementary fields\"))+(IF(LEFT(T39,1)=\"1\",((V51*AD51)*(AE51/(1-AE51))),IF(LEFT(T39,1)=\"2\",IF(COUNTA(V39:X39)=0,\"Fill in supplementary fields\",(W39+X39)*AE39*AD39))))","v":{"$error":"#VALUE!"}},{"$f":"IF(V39>W39,\"B cannot be higher than C\",IFERROR(IF(COUNTA(AA39:AB39)=0,\"Fill in supplementary fields\",IF(AA39=0,X39/2*(V39/W39)+X39/2*(1/AB39),(X39/2)*(V39/W39))),\"Fill in supplementary fields\"))+(IF(LEFT(T39,1)=\"1\",((V51*AD51)*(AE51/(1-AE51))),IF(LEFT(T39,1)=\"2\",IF(COUNTA(V39:X39)=0,\"Fill in supplementary fields\",(W39+X39)*AE39*AD39))))","v":{"$error":"#VALUE!"}},"Enter exposure values in fields A and B","Fill in supplementary fields","Fill in supplementary fields","Fill in supplementary fields","Fill in supplementary fields",0,0,0,0,0,0,0]
[null,null,null,null,null,null,null,null,null,null,null,null,null,null,null,null,null,null,"",null,null,null,null,null,null,"",null,null,null,null,null,null,null,null,null,null,null,"",36,"Fill in supplementary fields","Fill in supplementary fields",{"$f":"IF(V40>W40,\"B cannot be higher than C\",IF(COUNTA(AA40:AB40)=0,\"Fill in supplementary fields\",(X40/2)*(V40/W40)+(X40/2)*(1/SUM(AA40:AB40))))+(IF(LEFT(T40,1)=\"1\",((W40+X40)/AC40)*(V40/(W40+X40))*AD40*AE40*(AC40/(1-AE40)),IF(LEFT(T40,1)=\"2\",IF(COUNTA(V40:X40)=0,\"Fill in supplementary fields\",(W40+X40)*AE40*AD40))))","v":{"$error":"#VALUE!"}},{"$f":"IF(V40>W40,\"B cannot be higher than C\",IFERROR(IF(COUNTA(AA40:AB40)=0,\"Fill in supplementary fields\",X40/2)*(V40/W40)+(X40/2)*(1/AA40),\"Fill in supplementary fields\"))+(IF(LEFT(T40,1)=\"1\",((W40+X40)/AC40)*(V40/(W40+X40))*AD40*AE40*(AC40/(1-AE40)),IF(LEFT(T40,1)=\"2\",IF(COUNTA(V40:X40)=0,\"Fill in supplementary fields\",(W40+X40)*AE40*AD40))))","v":{"$error":"#VALUE!"}},{"$f":"IF(V40>W40,\"B cannot be higher than C\",IFERROR(IF(COUNTA(AA40:AB40)=0,\"Fill in supplementary fields\",IF(AA40=0,X40/2*(V40/W40)+X40/2*(1/AB40),(X40/2)*(V40/W40))),\"Fill in supplementary fields\"))+(IF(LEFT(T40,1)=\"1\",((W40+X40)/AC40)*(V40/(W40+X40))*AD40*AE40*(AC40/(1-AE40)),IF(LEFT(T40,1)=\"2\",IF(COUNTA(V40:X40)=0,\"Fill in supplementary fields\",(W40+X40)*AE40*AD40))))","v":{"$error":"#VALUE!"}},"Enter exposure values in fields A and B","Fill in supplementary fields","Fill in supplementary fields","Fill in supplementary fields","Fill in supplementary fields",0,0,0,0,0,0,0]
[null,null,null,null,null,null,null,null,null,null,null,null,null,null,null,null,null,null,"",null,null,null,null,null,null,"",null,null,null,null,null,null,null,null,null,null,null,"",37,"Fill in supplementary fields","Fill in supplementary fields",{"$error":"#VALUE!"},{"$error":"#VALUE!"},{"$error":"#VALUE!"},"Enter exposure values in fields A and B","Fill in supplementary fields","Fill in supplementary fields","Fill in supplementary fields","Fill in supplementary fields",0,0,0,0,0,0,0]
[null,null,null,null,null,null,null,null,null,null,null,null,null,null,null,null,null,null,"",null,null,null,null,null,null,"",null,null,null,null,null,null,null,null,null,null,null,"",38,"Fill in supplementary fields","Fill in supplementary fields",{"$f":"IF(V42>W42,\"B cannot be higher than C\",IF(COUNTA(AA42:AB42)=0,\"Fill in supplementary fields\",(X42/2)*(V42/W42)+(X42/2)*(1/SUM(AA42:AB42))))+(IF(LEFT(T42,1)=\"1\",((V54*AD54)*(AE54/(1-AE54))),IF(LEFT(T42,1)=\"2\",IF(COUNTA(V42:X42)=0,\"Fill in supplementary fields\",(W42+X42)*AE42*AD42))))","v":{"$error":"#VALUE!"}},{"$f":"IF(V42>W42,\"B cannot be higher than C\",IFERROR(IF(COUNTA(AA42:AB42)=0,\"Fill in supplementary fields\",X42/2)*(V42/W42)+(X42/2)*(1/AA42),\"Fill in supplementary fields\"))+(IF(LEFT(T42,1)=\"1\",((V54*AD54)*(AE54/(1-AE54))),IF(LEFT(T42,1)=\"2\",IF(COUNTA(V42:X42)=0,\"Fill in supplementary fields\",(W42+X42)*AE42*AD42))))","v":{"$error":"#VALUE!"}},{"$f":"IF(V42>W42,\"B cannot be higher than C\",IFERROR(IF(COUNTA(AA42:AB42)=0,\"Fill in supplementary fields\",IF(AA42=0,X42/2*(V42/W42)+X42/2*(1/AB42),(X42/2)*(V42/W42))),\"Fill in supplementary fields\"))+(IF(LEFT(T42,1)=\"1\",((V54*AD54)*(AE54/(1-AE54))),IF(LEFT(T42,1)=\"2\",IF(COUNTA(V42:X42)=0,\"Fill in supplementary fields\",(W42+X42)*AE42*AD42))))","v":{"$error":"#VALUE!"}},"Enter exposure values in fields A and B","Fill in supplementary fields","Fill in supplementary fields","Fill in supplementary fields","Fill in supplementary fields",0,0,0,0,0,0,0]
[null,null,null,null,null,null,null,null,null,null,null,null,null,null,null,null,null,null,"",null,null,null,null,null,null,"",null,null,null,null,null,null,null,null,null,null,null,"",39,"Fill in supplementary fields","Fill in supplementary fields",{"$f":"IF(V43>W43,\"B cannot be higher than C\",IF(COUNTA(AA43:AB43)=0,\"Fill in supplementary fields\",(X43/2)*(V43/W43)+(X43/2)*(1/SUM(AA43:AB43))))+(IF(LEFT(T43,1)=\"1\",((W43+X43)/AC43)*(V43/(W43+X43))*AD43*AE43*(AC43/(1-AE43)),IF(LEFT(T43,1)=\"2\",IF(COUNTA(V43:X43)=0,\"Fill in supplementary fields\",(W43+X43)*AE43*AD43))))","v":{"$error":"#VALUE!"}},{"$f":"IF(V43>W43,\"B cannot be higher than C\",IFERROR(IF(COUNTA(AA43:AB43)=0,\"Fill in supplementary fields\",X43/2)*(V43/W43)+(X43/2)*(1/AA43),\"Fill in supplementary fields\"))+(IF(LEFT(T43,1)=\"1\",((W43+X43)/AC43)*(V43/(W43+X43))*AD43*AE43*(AC43/(1-AE43)),IF(LEFT(T43,1)=\"2\",IF(COUNTA(V43:X43)=0,\"Fill in supplementary fields\",(W43+X43)*AE43*AD43))))","v":{"$error":"#VALUE!"}},{"$f":"IF(V43>W43,\"B cannot be higher than C\",IFERROR(IF(COUNTA(AA43:AB43)=0,\"Fill in supplementary fields\",IF(AA43=0,X43/2*(V43/W43)+X43/2*(1/AB43),(X43/2)*(V43/W43))),\"Fill in supplementary fields\"))+(IF(LEFT(T43,1)=\"1\",((W43+X43)/AC43)*(V43/(W43+X43))*AD43*AE43*(AC43/(1-AE43)),IF(LEFT(T43,1)=\"2\",IF(COUNTA(V43:X43)=0,\"Fill in supplementary fields\",(W43+X43)*AE43*AD43))))","v":{"$error":"#VALUE!"}},"Enter exposure values in fields A and B","Fill in supplementary fields","Fill in supplementary fields","Fill in supplementary fields","Fill in supplementary fields",0,0,0,0,0,0,0]
[null,null,null,null,null,null,null,null,null,null,null,null,null,null,null,null,null,null,"",null,null,null,null,null,null,"",null,null,null,null,null,null,null,null,null,null,null,"",40,"Fill in supplementary fields","Fill in supplementary fields",{"$error":"#VALUE!"},{"$error":"#VALUE!"},{"$error":"#VALUE!"},"Enter exposure values in fields A and B","Fill in supplementary fields","Fill in supplementary fields","Fill in supplementary fields","Fill in supplementary fields",0,0,0,0,0,0,0]
[null,null,null,null,null,null,null,null,null,null,null,null,null,null,null,null,null,null,"",null,null,null,null,null,null,"",null,null,null,null,null,null,null,null,null,null,null,"",41,"Fill in supplementary fields","Fill in supplementary fields",{"$f":"IF(V45>W45,\"B cannot be higher than C\",IF(COUNTA(AA45:AB45)=0,\"Fill in supplementary fields\",(X45/2)*(V45/W45)+(X45/2)*(1/SUM(AA45:AB45))))+(IF(LEFT(T45,1)=\"1\",((V57*AD57)*(AE57/(1-AE57))),IF(LEFT(T45,1)=\"2\",IF(COUNTA(V45:X45)=0,\"Fill in supplementary fields\",(W45+X45)*AE45*AD45))))","v":{"$error":"#VALUE!"}},{"$f":"IF(V45>W45,\"B cannot be higher than C\",IFERROR(IF(COUNTA(AA45:AB45)=0,\"Fill in supplementary fields\",X45/2)*(V45/W45)+(X45/2)*(1/AA45),\"Fill in supplementary fields\"))+(IF(LEFT(T45,1)=\"1\",((V57*AD57)*(AE57/(1-AE57))),IF(LEFT(T45,1)=\"2\",IF(COUNTA(V45:X45)=0,\"Fill in supplementary fields\",(W45+X45)*AE45*AD45))))","v":{"$error":"#VALUE!"}},{"$f":"IF(V45>W45,\"B cannot be higher than C\",IFERROR(IF(COUNTA(AA45:AB45)=0,\"Fill in supplementary fields\",IF(AA45=0,X45/2*(V45/W45)+X45/2*(1/AB45),(X45/2)*(V45/W45))),\"Fill in supplementary fields\"))+(IF(LEFT(T45,1)=\"1\",((V57*AD57)*(AE57/(1-AE57))),IF(LEFT(T45,1)=\"2\",IF(COUNTA(V45:X45)=0,\"Fill in supplementary fields\",(W45+X45)*AE45*AD45))))","v":{"$error":"#VALUE!"}},"Enter exposure values in fields A and B","Fill in supplementary fields","Fill in supplementary fields","Fill in supplementary fields","Fill in supplementary fields",0,0,0,0,0,0,0]
[null,null,null,null,null,null,null,null,null,null,null,null,null,null,null,null,null,null,"",null,null,null,null,null,null,"",null,null,null,null,null,null,null,null,null,null,null,"",42,"Fill in supplementary fields","Fill in supplementary fields",{"$f":"IF(V46>W46,\"B cannot be higher than C\",IF(COUNTA(AA46:AB46)=0,\"Fill in supplementary fields\",(X46/2)*(V46/W46)+(X46/2)*(1/SUM(AA46:AB46))))+(IF(LEFT(T46,1)=\"1\",((W46+X46)/AC46)*(V46/(W46+X46))*AD46*AE46*(AC46/(1-AE46)),IF(LEFT(T46,1)=\"2\",IF(COUNTA(V46:X46)=0,\"Fill in supplementary fields\",(W46+X46)*AE46*AD46))))","v":{"$error":"#VALUE!"}},{"$f":"IF(V46>W46,\"B cannot be higher than C\",IFERROR(IF(COUNTA(AA46:AB46)=0,\"Fill in supplementary fields\",X46/2)*(V46/W46)+(X46/2)*(1/AA46),\"Fill in supplementary fields\"))+(IF(LEFT(T46,1)=\"1\",((W46+X46)/AC46)*(V46/(W46+X46))*AD46*AE46*(AC46/(1-AE46)),IF(LEFT(T46,1)=\"2\",IF(COUNTA(V46:X46)=0,\"Fill in supplementary fields\",(W46+X46)*AE46*AD46))))","v":{"$error":"#VALUE!"}},{"$f":"IF(V46>W46,\"B cannot be higher than C\",IFERROR(IF(COUNTA(AA46:AB46)=0,\"Fill in supplementary fields\",IF(AA46=0,X46/2*(V46/W46)+X46/2*(1/AB46),(X46/2)*(V46/W46))),\"Fill in supplementary fields\"))+(IF(LEFT(T46,1)=\"1\",((W46+X46)/AC46)*(V46/(W46+X46))*AD46*AE46*(AC46/(1-AE46)),IF(LEFT(T46,1)=\"2\",IF(COUNTA(V46:X46)=0,\"Fill in supplementary fields\",(W46+X46)*AE46*AD46))))","v":{"$error":"#VALUE!"}},"Enter exposure values in fields A and B","Fill in supplementary fields","Fill in supplementary fields","Fill in supplementary fields","Fill in supplementary fields",0,0,0,0,0,0,0]
[null,null,null,null,null,null,null,null,null,null,null,null,null,null,null,null,null,null,"",null,null,null,null,null,null,"",null,null,null,null,null,null,null,null,null,null,null,"",43,"Fill in supplementary fields","Fill in supplementary fields",{"$error":"#VALUE!"},{"$error":"#VALUE!"},{"$error":"#VALUE!"},"Enter exposure values in fields A and B","Fill in supplementary fields","Fill in supplementary fields","Fill in supplementary fields","Fill in supplementary fields",0,0,0,0,0,0,0]
[null,null,null,null,null,null,null,null,null,null,null,null,null,null,null,null,null,null,"",null,null,null,null,null,null,"",null,null,null,null,null,null,null,null,null,null,null,"",44,"Fill in supplementary fields","Fill in supplementary fields",{"$f":"IF(V48>W48,\"B cannot be higher than C\",IF(COUNTA(AA48:AB48)=0,\"Fill in supplementary fields\",(X48/2)*(V48/W48)+(X48/2)*(1/SUM(AA48:AB48))))+(IF(LEFT(T48,1)=\"1\",((V60*AD60)*(AE60/(1-AE60))),IF(LEFT(T48,1)=\"2\",IF(COUNTA(V48:X48)=0,\"Fill in supplementary fields\",(W48+X48)*AE48*AD48))))","v":{"$error":"#VALUE!"}},{"$f":"IF(V48>W48,\"B cannot be higher than C\",IFERROR(IF(COUNTA(AA48:AB48)=0,\"Fill in supplementary fields\",X48/2)*(V48/W48)+(X48/2)*(1/AA48),\"Fill in supplementary fields\"))+(IF(LEFT(T48,1)=\"1\",((V60*AD60)*(AE60/(1-AE60))),IF(LEFT(T48,1)=\"2\",IF(COUNTA(V48:X48)=0,\"Fill in supplementary fields\",(W48+X48)*AE48*AD48))))","v":{"$error":"#VALUE!"}},{"$f":"IF(V48>W48,\"B cannot be higher than C\",IFERROR(IF(COUNTA(AA48:AB48)=0,\"Fill in supplementary fields\",IF(AA48=0,X48/2*(V48/W48)+X48/2*(1/AB48),(X48/2)*(V48/W48))),\"Fill in supplementary fields\"))+(IF(LEFT(T48,1)=\"1\",((V60*AD60)*(AE60/(1-AE60))),IF(LEFT(T48,1)=\"2\",IF(COUNTA(V48:X48)=0,\"Fill in supplementary fields\",(W48+X48)*AE48*AD48))))","v":{"$error":"#VALUE!"}},"Enter exposure values in fields A and B","Fill in supplementary fields","Fill in supplementary fields","Fill in supplementary fields","Fill in supplementary fields",0,0,0,0,0,0,0]
[null,null,null,null,null,null,null,null,null,null,null,null,null,null,null,null,null,null,"",null,null,null,null,null,null,"",null,null,null,null,null,null,null,null,null,null,null,"",45,"Fill in supplementary fields","Fill in supplementary fields",{"$f":"IF(V49>W49,\"B cannot be higher than C\",IF(COUNTA(AA49:AB49)=0,\"Fill in supplementary fields\",(X49/2)*(V49/W49)+(X49/2)*(1/SUM(AA49:AB49))))+(IF(LEFT(T49,1)=\"1\",((W49+X49)/AC49)*(V49/(W49+X49))*AD49*AE49*(AC49/(1-AE49)),IF(LEFT(T49,1)=\"2\",IF(COUNTA(V49:X49)=0,\"Fill in supplementary fields\",(W49+X49)*AE49*AD49))))","v":{"$error":"#VALUE!"}},{"$f":"IF(V49>W49,\"B cannot be higher than C\",IFERROR(IF(COUNTA(AA49:AB49)=0,\"Fill in supplementary fields\",X49/2)*(V49/W49)+(X49/2)*(1/AA49),\"Fill in supplementary fields\"))+(IF(LEFT(T49,1)=\"1\",((W49+X49)/AC49)*(V49/(W49+X49))*AD49*AE49*(AC49/(1-AE49)),IF(LEFT(T49,1)=\"2\",IF(COUNTA(V49:X49)=0,\"Fill in supplementary fields\",(W49+X49)*AE49*AD49))))","v":{"$error":"#VALUE!"}},{"$f":"IF(V49>W49,\"B cannot be higher than C\",IFERROR(IF(COUNTA(AA49:AB49)=0,\"Fill in supplementary fields\",IF(AA49=0,X49/2*(V49/W49)+X49/2*(1/AB49),(X49/2)*(V49/W49))),\"Fill in supplementary fields\"))+(IF(LEFT(T49,1)=\"1\",((W49+X49)/AC49)*(V49/(W49+X49))*AD49*AE49*(AC49/(1-AE49)),IF(LEFT(T49,1)=\"2\",IF(COUNTA(V49:X49)=0,\"Fill in supplementary fields\",(W49+X49)*AE49*AD49))))","v":{"$error":"#VALUE!"}},"Enter exposure values in fields A and B","Fill in supplementary fields","Fill in supplementary fields","Fill in supplementary fields","Fill in supplementary fields",0,0,0,0,0,0,0]
[null,null,null,null,null,null,null,null,null,null,null,null,null,null,null,null,null,null,"",null,null,null,null,null,null,"",null,null,null,null,null,null,null,null,null,null,null,"",46,"Fill in supplementary fields","Fill in supplementary fields",{"$error":"#VALUE!"},{"$error":"#VALUE!"},{"$error":"#VALUE!"},"Enter exposure values in fields A and B","Fill in supplementary fields","Fill in supplementary fields","Fill in supplementary fields","Fill in supplementary fields",0,0,0,0,0,0,0]
[null,null,null,null,null,null,null,null,null,null,null,null,null,null,null,null,null,null,"",null,null,null,null,null,null,"",null,null,null,null,null,null,null,null,null,null,null,"",47,"Fill in supplementary fields","Fill in supplementary fields",{"$f":"IF(V51>W51,\"B cannot be higher than C\",IF(COUNTA(AA51:AB51)=0,\"Fill in supplementary fields\",(X51/2)*(V51/W51)+(X51/2)*(1/SUM(AA51:AB51))))+(IF(LEFT(T51,1)=\"1\",((V63*AD63)*(AE63/(1-AE63))),IF(LEFT(T51,1)=\"2\",IF(COUNTA(V51:X51)=0,\"Fill in supplementary fields\",(W51+X51)*AE51*AD51))))","v":{"$error":"#VALUE!"}},{"$f":"IF(V51>W51,\"B cannot be higher than C\",IFERROR(IF(COUNTA(AA51:AB51)=0,\"Fill in supplementary fields\",X51/2)*(V51/W51)+(X51/2)*(1/AA51),\"Fill in supplementary fields\"))+(IF(LEFT(T51,1)=\"1\",((V63*AD63)*(AE63/(1-AE63))),IF(LEFT(T51,1)=\"2\",IF(COUNTA(V51:X51)=0,\"Fill in supplementary fields\",(W51+X51)*AE51*AD51))))","v":{"$error":"#VALUE!"}},{"$f":"IF(V51>W51,\"B cannot be higher than C\",IFERROR(IF(COUNTA(AA51:AB51)=0,\"Fill in supplementary fields\",IF(AA51=0,X51/2*(V51/W51)+X51/2*(1/AB51),(X51/2)*(V51/W51))),\"Fill in supplementary fields\"))+(IF(LEFT(T51,1)=\"1\",((V63*AD63)*(AE63/(1-AE63))),IF(LEFT(T51,1)=\"2\",IF(COUNTA(V51:X51)=0,\"Fill in supplementary fields\",(W51+X51)*AE51*AD51))))","v":{"$error":"#VALUE!"}},"Enter exposure values in fields A and B","Fill in supplementary fields","Fill in supplementary fields","Fill in supplementary fields","Fill in supplementary fields",0,0,0,0,0,0,0]
[null,null,null,null,null,null,null,null,null,null,null,null,null,null,null,null,null,null,"",null,null,null,null,null,null,"",null,null,null,null,null,null,null,null,null,null,null,"",48,"Fill in supplementary fields","Fill in supplementary fields",{"$f":"IF(V52>W52,\"B cannot be higher than C\",IF(COUNTA(AA52:AB52)=0,\"Fill in supplementary fields\",(X52/2)*(V52/W52)+(X52/2)*(1/SUM(AA52:AB52))))+(IF(LEFT(T52,1)=\"1\",((W52+X52)/AC52)*(V52/(W52+X52))*AD52*AE52*(AC52/(1-AE52)),IF(LEFT(T52,1)=\"2\",IF(COUNTA(V52:X52)=0,\"Fill in supplementary fields\",(W52+X52)*AE52*AD52))))","v":{"$error":"#VALUE!"}},{"$f":"IF(V52>W52,\"B cannot be higher than C\",IFERROR(IF(COUNTA(AA52:AB52)=0,\"Fill in supplementary fields\",X52/2)*(V52/W52)+(X52/2)*(1/AA52),\"Fill in supplementary fields\"))+(IF(LEFT(T52,1)=\"1\",((W52+X52)/AC52)*(V52/(W52+X52))*AD52*AE52*(AC52/(1-AE52)),IF(LEFT(T52,1)=\"2\",IF(COUNTA(V52:X52)=0,\"Fill in supplementary fields\",(W52+X52)*AE52*AD52))))","v":{"$error":"#VALUE!"}},{"$f":"IF(V52>W52,\"B cannot be higher than C\",IFERROR(IF(COUNTA(AA52:AB52)=0,\"Fill in supplementary fields\",IF(AA52=0,X52/2*(V52/W52)+X52/2*(1/AB52),(X52/2)*(V52/W52))),\"Fill in supplementary fields\"))+(IF(LEFT(T52,1)=\"1\",((W52+X52)/AC52)*(V52/(W52+X52))*AD52*AE52*(AC52/(1-AE52)),IF(LEFT(T52,1)=\"2\",IF(COUNTA(V52:X52)=0,\"Fill in supplementary fields\",(W52+X52)*AE52*AD52))))","v":{"$error":"#VALUE!"}},"Enter exposure values in fields A and B","Fill in supplementary fields","Fill in supplementary fields","Fill in supplementary fields","Fill in supplementary fields",0,0,0,0,0,0,0]
[null,null,null,null,null,null,null,null,null,null,null,null,null,null,null,null,null,null,"",null,null,null,null,null,null,"",null,null,null,null,null,null,null,null,null,null,null,"",49,"Fill in supplementary fields","Fill in supplementary fields",{"$error":"#VALUE!"},{"$error":"#VALUE!"},{"$error":"#VALUE!"},"Enter exposure values in fields A and B","Fill in supplementary fields","Fill in supplementary fields","Fill in supplementary fields","Fill in supplementary fields",0,0,0,0,0,0,0]
[null,null,null,null,null,null,null,null,null,null,null,null,null,null,null,null,null,null,"",null,null,null,null,null,null,"",null,null,null,null,null,null,null,null,null,null,null,"",50,"Fill in supplementary fields","Fill in supplementary fields",{"$f":"IF(V54>W54,\"B cannot be higher than C\",IF(COUNTA(AA54:AB54)=0,\"Fill in supplementary fields\",(X54/2)*(V54/W54)+(X54/2)*(1/SUM(AA54:AB54))))+(IF(LEFT(T54,1)=\"1\",((V66*AD66)*(AE66/(1-AE66))),IF(LEFT(T54,1)=\"2\",IF(COUNTA(V54:X54)=0,\"Fill in supplementary fields\",(W54+X54)*AE54*AD54))))","v":{"$error":"#VALUE!"}},{"$f":"IF(V54>W54,\"B cannot be higher than C\",IFERROR(IF(COUNTA(AA54:AB54)=0,\"Fill in supplementary fields\",X54/2)*(V54/W54)+(X54/2)*(1/AA54),\"Fill in supplementary fields\"))+(IF(LEFT(T54,1)=\"1\",((V66*AD66)*(AE66/(1-AE66))),IF(LEFT(T54,1)=\"2\",IF(COUNTA(V54:X54)=0,\"Fill in supplementary fields\",(W54+X54)*AE54*AD54))))","v":{"$error":"#VALUE!"}},{"$f":"IF(V54>W54,\"B cannot be higher than C\",IFERROR(IF(COUNTA(AA54:AB54)=0,\"Fill in supplementary fields\",IF(AA54=0,X54/2*(V54/W54)+X54/2*(1/AB54),(X54/2)*(V54/W54))),\"Fill in supplementary fields\"))+(IF(LEFT(T54,1)=\"1\",((V66*AD66)*(AE66/(1-AE66))),IF(LEFT(T54,1)=\"2\",IF(COUNTA(V54:X54)=0,\"Fill in supplementary fields\",(W54+X54)*AE54*AD54))))","v":{"$error":"#VALUE!"}},"Enter exposure values in fields A and B","Fill in supplementary fields","Fill in supplementary fields","Fill in supplementary fields","Fill in supplementary fields",{"$f":"$X54","v":0},0,0,0,0,0,0]
[null,null,null,null,null,null,null,null,null,null,null,null,null,null,null,null,null,null,"",null,null,null,null,null,null,"",null,null,null,null,null,null,null,null,null,null,null,"",51,"Fill in supplementary fields","Fill in supplementary fields",{"$f":"IF(V55>W55,\"B cannot be higher than C\",IF(COUNTA(AA55:AB55)=0,\"Fill in supplementary fields\",(X55/2)*(V55/W55)+(X55/2)*(1/SUM(AA55:AB55))))+(IF(LEFT(T55,1)=\"1\",((W55+X55)/AC55)*(V55/(W55+X55))*AD55*AE55*(AC55/(1-AE55)),IF(LEFT(T55,1)=\"2\",IF(COUNTA(V55:X55)=0,\"Fill in supplementary fields\",(W55+X55)*AE55*AD55))))","v":{"$error":"#VALUE!"}},{"$f":"IF(V55>W55,\"B cannot be higher than C\",IFERROR(IF(COUNTA(AA55:AB55)=0,\"Fill in supplementary fields\",X55/2)*(V55/W55)+(X55/2)*(1/AA55),\"Fill in supplementary fields\"))+(IF(LEFT(T55,1)=\"1\",((W55+X55)/AC55)*(V55/(W55+X55))*AD55*AE55*(AC55/(1-AE55)),IF(LEFT(T55,1)=\"2\",IF(COUNTA(V55:X55)=0,\"Fill in supplementary fields\",(W55+X55)*AE55*AD55))))","v":{"$error":"#VALUE!"}},{"$f":"IF(V55>W55,\"B cannot be higher than C\",IFERROR(IF(COUNTA(AA55:AB55)=0,\"Fill in supplementary fields\",IF(AA55=0,X55/2*(V55/W55)+X55/2*(1/AB55),(X55/2)*(V55/W55))),\"Fill in supplementary fields\"))+(IF(LEFT(T55,1)=\"1\",((W55+X55)/AC55)*(V55/(W55+X55))*AD55*AE55*(AC55/(1-AE55)),IF(LEFT(T55,1)=\"2\",IF(COUNTA(V55:X55)=0,\"Fill in supplementary fields\",(W55+X55)*AE55*AD55))))","v":{"$error":"#VALUE!"}},"Enter exposure values in fields A and B","Fill in supplementary fields","Fill in supplementary fields","Fill in supplementary fields","Fill in supplementary fields",0,0,0,0,0,0,0]
[null,null,null,null,null,null,null,null,null,null,null,null,null,null,null,null,null,null,"",null,null,null,null,null,null,"",null,null,null,null,null,null,null,null,null,null,null,"",52,"Fill in supplementary fields","Fill in supplementary fields",{"$error":"#VALUE!"},{"$error":"#VALUE!"},{"$error":"#VALUE!"},"Enter exposure values in fields A and B","Fill in supplementary fields","Fill in supplementary fields","Fill in supplementary fields","Fill in supplementary fields",0,0,0,0,0,0,0]
[null,null,null,null,null,null,null,null,null,null,null,null,null,null,null,null,null,null,"",null,null,null,null,null,null,"",null,null,null,null,null,null,null,null,null,null,null,"",53,"Fill in supplementary fields","Fill in supplementary fields",{"$f":"IF(V57>W57,\"B cannot be higher than C\",IF(COUNTA(AA57:AB57)=0,\"Fill in supplementary fields\",(X57/2)*(V57/W57)+(X57/2)*(1/SUM(AA57:AB57))))+(IF(LEFT(T57,1)=\"1\",((V69*AD69)*(AE69/(1-AE69))),IF(LEFT(T57,1)=\"2\",IF(COUNTA(V57:X57)=0,\"Fill in supplementary fields\",(W57+X57)*AE57*AD57))))","v":{"$error":"#VALUE!"}},{"$f":"IF(V57>W57,\"B cannot be higher than C\",IFERROR(IF(COUNTA(AA57:AB57)=0,\"Fill in supplementary fields\",X57/2)*(V57/W57)+(X57/2)*(1/AA57),\"Fill in supplementary fields\"))+(IF(LEFT(T57,1)=\"1\",((V69*AD69)*(AE69/(1-AE69))),IF(LEFT(T57,1)=\"2\",IF(COUNTA(V57:X57)=0,\"Fill in supplementary fields\",(W57+X57)*AE57*AD57))))","v":{"$error":"#VALUE!"}},{"$f":"IF(V57>W57,\"B cannot be higher than C\",IFERROR(IF(COUNTA(AA57:AB57)=0,\"Fill in supplementary fields\",IF(AA57=0,X57/2*(V57/W57)+X57/2*(1/AB57),(X57/2)*(V57/W57))),\"Fill in supplementary fields\"))+(IF(LEFT(T57,1)=\"1\",((V69*AD69)*(AE69/(1-AE69))),IF(LEFT(T57,1)=\"2\",IF(COUNTA(V57:X57)=0,\"Fill in supplementary fields\",(W57+X57)*AE57*AD57))))","v":{"$error":"#VALUE!"}},"Enter exposure values in fields A and B","Fill in supplementary fields","Fill in supplementary fields","Fill in supplementary fields","Fill in supplementary fields",0,0,0,0,0,0,0]
[null,null,null,null,null,null,null,null,null,null,null,null,null,null,null,null,null,null,"",null,null,null,null,null,null,"",null,null,null,null,null,null,null,null,null,null,null,"",54,"Fill in supplementary fields","Fill in supplementary fields",{"$f":"IF(V58>W58,\"B cannot be higher than C\",IF(COUNTA(AA58:AB58)=0,\"Fill in supplementary fields\",(X58/2)*(V58/W58)+(X58/2)*(1/SUM(AA58:AB58))))+(IF(LEFT(T58,1)=\"1\",((W58+X58)/AC58)*(V58/(W58+X58))*AD58*AE58*(AC58/(1-AE58)),IF(LEFT(T58,1)=\"2\",IF(COUNTA(V58:X58)=0,\"Fill in supplementary fields\",(W58+X58)*AE58*AD58))))","v":{"$error":"#VALUE!"}},{"$f":"IF(V58>W58,\"B cannot be higher than C\",IFERROR(IF(COUNTA(AA58:AB58)=0,\"Fill in supplementary fields\",X58/2)*(V58/W58)+(X58/2)*(1/AA58),\"Fill in supplementary fields\"))+(IF(LEFT(T58,1)=\"1\",((W58+X58)/AC58)*(V58/(W58+X58))*AD58*AE58*(AC58/(1-AE58)),IF(LEFT(T58,1)=\"2\",IF(COUNTA(V58:X58)=0,\"Fill in supplementary fields\",(W58+X58)*AE58*AD58))))","v":{"$error":"#VALUE!"}},{"$f":"IF(V58>W58,\"B cannot be higher than C\",IFERROR(IF(COUNTA(AA58:AB58)=0,\"Fill in supplementary fields\",IF(AA58=0,X58/2*(V58/W58)+X58/2*(1/AB58),(X58/2)*(V58/W58))),\"Fill in supplementary fields\"))+(IF(LEFT(T58,1)=\"1\",((W58+X58)/AC58)*(V58/(W58+X58))*AD58*AE58*(AC58/(1-AE58)),IF(LEFT(T58,1)=\"2\",IF(COUNTA(V58:X58)=0,\"Fill in supplementary fields\",(W58+X58)*AE58*AD58))))","v":{"$error":"#VALUE!"}},"Enter exposure values in fields A and B","Fill in supplementary fields","Fill in supplementary fields","Fill in supplementary fields","Fill in supplementary fields",0,0,0,0,0,0,0]
[null,null,null,null,null,null,null,null,null,null,null,null,null,null,null,null,null,null,"",null,null,null,null,null,null,"",null,null,null,null,null,null,null,null,null,null,null,"",55,"Fill in supplementary fields","Fill in supplementary fields",{"$error":"#VALUE!"},{"$error":"#VALUE!"},{"$error":"#VALUE!"},"Enter exposure values in fields A and B","Fill in supplementary fields","Fill in supplementary fields","Fill in supplementary fields","Fill in supplementary fields",0,0,0,0,0,0,0]
[null,null,null,null,null,null,null,null,null,null,null,null,null,null,null,null,null,null,"",null,null,null,null,null,null,"",null,null,null,null,null,null,null,null,null,null,null,"",56,"Fill in supplementary fields","Fill in supplementary fields",{"$f":"IF(V60>W60,\"B cannot be higher than C\",IF(COUNTA(AA60:AB60)=0,\"Fill in supplementary fields\",(X60/2)*(V60/W60)+(X60/2)*(1/SUM(AA60:AB60))))+(IF(LEFT(T60,1)=\"1\",((V72*AD72)*(AE72/(1-AE72))),IF(LEFT(T60,1)=\"2\",IF(COUNTA(V60:X60)=0,\"Fill in supplementary fields\",(W60+X60)*AE60*AD60))))","v":{"$error":"#VALUE!"}},{"$f":"IF(V60>W60,\"B cannot be higher than C\",IFERROR(IF(COUNTA(AA60:AB60)=0,\"Fill in supplementary fields\",X60/2)*(V60/W60)+(X60/2)*(1/AA60),\"Fill in supplementary fields\"))+(IF(LEFT(T60,1)=\"1\",((V72*AD72)*(AE72/(1-AE72))),IF(LEFT(T60,1)=\"2\",IF(COUNTA(V60:X60)=0,\"Fill in supplementary fields\",(W60+X60)*AE60*AD60))))","v":{"$error":"#VALUE!"}},{"$f":"IF(V60>W60,\"B cannot be higher than C\",IFERROR(IF(COUNTA(AA60:AB60)=0,\"Fill in supplementary fields\",IF(AA60=0,X60/2*(V60/W60)+X60/2*(1/AB60),(X60/2)*(V60/W60))),\"Fill in supplementary fields\"))+(IF(LEFT(T60,1)=\"1\",((V72*AD72)*(AE72/(1-AE72))),IF(LEFT(T60,1)=\"2\",IF(COUNTA(V60:X60)=0,\"Fill in supplementary fields\",(W60+X60)*AE60*AD60))))","v":{"$error":"#VALUE!"}},"Enter exposure values in fields A and B","Fill in supplementary fields","Fill in supplementary fields","Fill in supplementary fields","Fill in supplementary fields",0,0,0,0,0,0,0]
[null,null,null,null,null,null,null,null,null,null,null,null,null,null,null,null,null,null,"",null,null,null,null,null,null,"",null,null,null,null,null,null,null,null,null,null,null,"",57,"Fill in supplementary fields","Fill in supplementary fields",{"$f":"IF(V61>W61,\"B cannot be higher than C\",IF(COUNTA(AA61:AB61)=0,\"Fill in supplementary fields\",(X61/2)*(V61/W61)+(X61/2)*(1/SUM(AA61:AB61))))+(IF(LEFT(T61,1)=\"1\",((W61+X61)/AC61)*(V61/(W61+X61))*AD61*AE61*(AC61/(1-AE61)),IF(LEFT(T61,1)=\"2\",IF(COUNTA(V61:X61)=0,\"Fill in supplementary fields\",(W61+X61)*AE61*AD61))))","v":{"$error":"#VALUE!"}},{"$f":"IF(V61>W61,\"B cannot be higher than C\",IFERROR(IF(COUNTA(AA61:AB61)=0,\"Fill in supplementary fields\",X61/2)*(V61/W61)+(X61/2)*(1/AA61),\"Fill in supplementary fields\"))+(IF(LEFT(T61,1)=\"1\",((W61+X61)/AC61)*(V61/(W61+X61))*AD61*AE61*(AC61/(1-AE61)),IF(LEFT(T61,1)=\"2\",IF(COUNTA(V61:X61)=0,\"Fill in supplementary fields\",(W61+X61)*AE61*AD61))))","v":{"$error":"#VALUE!"}},{"$f":"IF(V61>W61,\"B cannot be higher than C\",IFERROR(IF(COUNTA(AA61:AB61)=0,\"Fill in supplementary fields\",IF(AA61=0,X61/2*(V61/W61)+X61/2*(1/AB61),(X61/2)*(V61/W61))),\"Fill in supplementary fields\"))+(IF(LEFT(T61,1)=\"1\",((W61+X61)/AC61)*(V61/(W61+X61))*AD61*AE61*(AC61/(1-AE61)),IF(LEFT(T61,1)=\"2\",IF(COUNTA(V61:X61)=0,\"Fill in supplementary fields\",(W61+X61)*AE61*AD61))))","v":{"$error":"#VALUE!"}},"Enter exposure values in fields A and B","Fill in supplementary fields","Fill in supplementary fields","Fill in supplementary fields","Fill in supplementary fields",0,0,0,0,0,0,0]
[null,null,null,null,null,null,null,null,null,null,null,null,null,null,null,null,null,null,"",null,null,null,null,null,null,"",null,null,null,null,null,null,null,null,null,null,null,"",58,"Fill in supplementary fields","Fill in supplementary fields",{"$error":"#VALUE!"},{"$error":"#VALUE!"},{"$error":"#VALUE!"},"Enter exposure values in fields A and B","Fill in supplementary fields","Fill in supplementary fields","Fill in supplementary fields","Fill in supplementary fields",0,0,0,0,0,0,0]
[null,null,null,null,null,null,null,null,null,null,null,null,null,null,null,null,null,null,"",null,null,null,null,null,null,"",null,null,null,null,null,null,null,null,null,null,null,"",59,"Fill in supplementary fields","Fill in supplementary fields",{"$f":"IF(V63>W63,\"B cannot be higher than C\",IF(COUNTA(AA63:AB63)=0,\"Fill in supplementary fields\",(X63/2)*(V63/W63)+(X63/2)*(1/SUM(AA63:AB63))))+(IF(LEFT(T63,1)=\"1\",((V75*AD75)*(AE75/(1-AE75))),IF(LEFT(T63,1)=\"2\",IF(COUNTA(V63:X63)=0,\"Fill in supplementary fields\",(W63+X63)*AE63*AD63))))","v":{"$error":"#VALUE!"}},{"$f":"IF(V63>W63,\"B cannot be higher than C\",IFERROR(IF(COUNTA(AA63:AB63)=0,\"Fill in supplementary fields\",X63/2)*(V63/W63)+(X63/2)*(1/AA63),\"Fill in supplementary fields\"))+(IF(LEFT(T63,1)=\"1\",((V75*AD75)*(AE75/(1-AE75))),IF(LEFT(T63,1)=\"2\",IF(COUNTA(V63:X63)=0,\"Fill in supplementary fields\",(W63+X63)*AE63*AD63))))","v":{"$error":"#VALUE!"}},{"$f":"IF(V63>W63,\"B cannot be higher than C\",IFERROR(IF(COUNTA(AA63:AB63)=0,\"Fill in supplementary fields\",IF(AA63=0,X63/2*(V63/W63)+X63/2*(1/AB63),(X63/2)*(V63/W63))),\"Fill in supplementary fields\"))+(IF(LEFT(T63,1)=\"1\",((V75*AD75)*(AE75/(1-AE75))),IF(LEFT(T63,1)=\"2\",IF(COUNTA(V63:X63)=0,\"Fill in supplementary fields\",(W63+X63)*AE63*AD63))))","v":{"$error":"#VALUE!"}},"Enter exposure values in fields A and B","Fill in supplementary fields","Fill in supplementary fields","Fill in supplementary fields","Fill in supplementary fields",0,0,0,0,0,0,0]
[null,null,null,null,null,null,null,null,null,null,null,null,null,null,null,null,null,null,"",null,null,null,null,null,null,"",null,null,null,null,null,null,null,null,null,null,null,"",60,"Fill in supplementary fields","Fill in supplementary fields",{"$f":"IF(V64>W64,\"B cannot be higher than C\",IF(COUNTA(AA64:AB64)=0,\"Fill in supplementary fields\",(X64/2)*(V64/W64)+(X64/2)*(1/SUM(AA64:AB64))))+(IF(LEFT(T64,1)=\"1\",((W64+X64)/AC64)*(V64/(W64+X64))*AD64*AE64*(AC64/(1-AE64)),IF(LEFT(T64,1)=\"2\",IF(COUNTA(V64:X64)=0,\"Fill in supplementary fields\",(W64+X64)*AE64*AD64))))","v":{"$error":"#VALUE!"}},{"$f":"IF(V64>W64,\"B cannot be higher than C\",IFERROR(IF(COUNTA(AA64:AB64)=0,\"Fill in supplementary fields\",X64/2)*(V64/W64)+(X64/2)*(1/AA64),\"Fill in supplementary fields\"))+(IF(LEFT(T64,1)=\"1\",((W64+X64)/AC64)*(V64/(W64+X64))*AD64*AE64*(AC64/(1-AE64)),IF(LEFT(T64,1)=\"2\",IF(COUNTA(V64:X64)=0,\"Fill in supplementary fields\",(W64+X64)*AE64*AD64))))","v":{"$error":"#VALUE!"}},{"$f":"IF(V64>W64,\"B cannot be higher than C\",IFERROR(IF(COUNTA(AA64:AB64)=0,\"Fill in supplementary fields\",IF(AA64=0,X64/2*(V64/W64)+X64/2*(1/AB64),(X64/2)*(V64/W64))),\"Fill in supplementary fields\"))+(IF(LEFT(T64,1)=\"1\",((W64+X64)/AC64)*(V64/(W64+X64))*AD64*AE64*(AC64/(1-AE64)),IF(LEFT(T64,1)=\"2\",IF(COUNTA(V64:X64)=0,\"Fill in supplementary fields\",(W64+X64)*AE64*AD64))))","v":{"$error":"#VALUE!"}},"Enter exposure values in fields A and B","Fill in supplementary fields","Fill in supplementary fields","Fill in supplementary fields","Fill in supplementary fields",0,0,0,0,0,0,0]
[null,null,null,null,null,null,null,null,null,null,null,null,null,null,null,null,null,null,"",null,null,null,null,null,null,"",null,null,null,null,null,null,null,null,null,null,null,"",61,"Fill in supplementary fields","Fill in supplementary fields",{"$error":"#VALUE!"},{"$error":"#VALUE!"},{"$error":"#VALUE!"},"Enter exposure values in fields A and B","Fill in supplementary fields","Fill in supplementary fields","Fill in supplementary fields","Fill in supplementary fields",0,0,0,0,0,0,0]
[null,null,null,null,null,null,null,null,null,null,null,null,null,null,null,null,null,null,"",null,null,null,null,null,null,"",null,null,null,null,null,null,null,null,null,null,null,"",62,"Fill in supplementary fields","Fill in supplementary fields",{"$f":"IF(V66>W66,\"B cannot be higher than C\",IF(COUNTA(AA66:AB66)=0,\"Fill in supplementary fields\",(X66/2)*(V66/W66)+(X66/2)*(1/SUM(AA66:AB66))))+(IF(LEFT(T66,1)=\"1\",((V78*AD78)*(AE78/(1-AE78))),IF(LEFT(T66,1)=\"2\",IF(COUNTA(V66:X66)=0,\"Fill in supplementary fields\",(W66+X66)*AE66*AD66))))","v":{"$error":"#VALUE!"}},{"$f":"IF(V66>W66,\"B cannot be higher than C\",IFERROR(IF(COUNTA(AA66:AB66)=0,\"Fill in supplementary fields\",X66/2)*(V66/W66)+(X66/2)*(1/AA66),\"Fill in supplementary fields\"))+(IF(LEFT(T66,1)=\"1\",((V78*AD78)*(AE78/(1-AE78))),IF(LEFT(T66,1)=\"2\",IF(COUNTA(V66:X66)=0,\"Fill in supplementary fields\",(W66+X66)*AE66*AD66))))","v":{"$error":"#VALUE!"}},{"$f":"IF(V66>W66,\"B cannot be higher than C\",IFERROR(IF(COUNTA(AA66:AB66)=0,\"Fill in supplementary fields\",IF(AA66=0,X66/2*(V66/W66)+X66/2*(1/AB66),(X66/2)*(V66/W66))),\"Fill in supplementary fields\"))+(IF(LEFT(T66,1)=\"1\",((V78*AD78)*(AE78/(1-AE78))),IF(LEFT(T66,1)=\"2\",IF(COUNTA(V66:X66)=0,\"Fill in supplementary fields\",(W66+X66)*AE66*AD66))))","v":{"$error":"#VALUE!"}},"Enter exposure values in fields A and B","Fill in supplementary fields","Fill in supplementary fields","Fill in supplementary fields","Fill in supplementary fields",0,0,0,0,0,0,0]
[null,null,null,null,null,null,null,null,null,null,null,null,null,null,null,null,null,null,"",null,null,null,null,null,null,"",null,null,null,null,null,null,null,null,null,null,null,"",63,"Fill in supplementary fields","Fill in supplementary fields",{"$f":"IF(V67>W67,\"B cannot be higher than C\",IF(COUNTA(AA67:AB67)=0,\"Fill in supplementary fields\",(X67/2)*(V67/W67)+(X67/2)*(1/SUM(AA67:AB67))))+(IF(LEFT(T67,1)=\"1\",((W67+X67)/AC67)*(V67/(W67+X67))*AD67*AE67*(AC67/(1-AE67)),IF(LEFT(T67,1)=\"2\",IF(COUNTA(V67:X67)=0,\"Fill in supplementary fields\",(W67+X67)*AE67*AD67))))","v":{"$error":"#VALUE!"}},{"$f":"IF(V67>W67,\"B cannot be higher than C\",IFERROR(IF(COUNTA(AA67:AB67)=0,\"Fill in supplementary fields\",X67/2)*(V67/W67)+(X67/2)*(1/AA67),\"Fill in supplementary fields\"))+(IF(LEFT(T67,1)=\"1\",((W67+X67)/AC67)*(V67/(W67+X67))*AD67*AE67*(AC67/(1-AE67)),IF(LEFT(T67,1)=\"2\",IF(COUNTA(V67:X67)=0,\"Fill in supplementary fields\",(W67+X67)*AE67*AD67))))","v":{"$error":"#VALUE!"}},{"$f":"IF(V67>W67,\"B cannot be higher than C\",IFERROR(IF(COUNTA(AA67:AB67)=0,\"Fill in supplementary fields\",IF(AA67=0,X67/2*(V67/W67)+X67/2*(1/AB67),(X67/2)*(V67/W67))),\"Fill in supplementary fields\"))+(IF(LEFT(T67,1)=\"1\",((W67+X67)/AC67)*(V67/(W67+X67))*AD67*AE67*(AC67/(1-AE67)),IF(LEFT(T67,1)=\"2\",IF(COUNTA(V67:X67)=0,\"Fill in supplementary fields\",(W67+X67)*AE67*AD67))))","v":{"$error":"#VALUE!"}},"Enter exposure values in fields A and B","Fill in supplementary fields","Fill in supplementary fields","Fill in supplementary fields","Fill in supplementary fields",0,0,0,0,0,0,0]
[null,null,null,null,null,null,null,null,null,null,null,null,null,null,null,null,null,null,"",null,null,null,null,null,null,"",null,null,null,null,null,null,null,null,null,null,null,"",64,"Fill in supplementary fields","Fill in supplementary fields",{"$error":"#VALUE!"},{"$error":"#VALUE!"},{"$error":"#VALUE!"},"Enter exposure values in fields A and B","Fill in supplementary fields","Fill in supplementary fields","Fill in supplementary fields","Fill in supplementary fields",0,0,0,0,0,0,0]
[null,null,null,null,null,null,null,null,null,null,null,null,null,null,null,null,null,null,"",null,null,null,null,null,null,"",null,null,null,null,null,null,null,null,null,null,null,"",65,"Fill in supplementary fields","Fill in supplementary fields",{"$f":"IF(V69>W69,\"B cannot be higher than C\",IF(COUNTA(AA69:AB69)=0,\"Fill in supplementary fields\",(X69/2)*(V69/W69)+(X69/2)*(1/SUM(AA69:AB69))))+(IF(LEFT(T69,1)=\"1\",((V81*AD81)*(AE81/(1-AE81))),IF(LEFT(T69,1)=\"2\",IF(COUNTA(V69:X69)=0,\"Fill in supplementary fields\",(W69+X69)*AE69*AD69))))","v":{"$error":"#VALUE!"}},{"$f":"IF(V69>W69,\"B cannot be higher than C\",IFERROR(IF(COUNTA(AA69:AB69)=0,\"Fill in supplementary fields\",X69/2)*(V69/W69)+(X69/2)*(1/AA69),\"Fill in supplementary fields\"))+(IF(LEFT(T69,1)=\"1\",((V81*AD81)*(AE81/(1-AE81))),IF(LEFT(T69,1)=\"2\",IF(COUNTA(V69:X69)=0,\"Fill in supplementary fields\",(W69+X69)*AE69*AD69))))","v":{"$error":"#VALUE!"}},{"$f":"IF(V69>W69,\"B cannot be higher than C\",IFERROR(IF(COUNTA(AA69:AB69)=0,\"Fill in supplementary fields\",IF(AA69=0,X69/2*(V69/W69)+X69/2*(1/AB69),(X69/2)*(V69/W69))),\"Fill in supplementary fields\"))+(IF(LEFT(T69,1)=\"1\",((V81*AD81)*(AE81/(1-AE81))),IF(LEFT(T69,1)=\"2\",IF(COUNTA(V69:X69)=0,\"Fill in supplementary fields\",(W69+X69)*AE69*AD69))))","v":{"$error":"#VALUE!"}},"Enter exposure values in fields A and B","Fill in supplementary fields","Fill in supplementary fields","Fill in supplementary fields","Fill in supplementary fields",0,0,0,0,0,0,0]
[null,null,null,null,null,null,null,null,null,null,null,null,null,null,null,null,null,null,{"$f":"IF(LEN(Q70)=0,\"\",HLOOKUP(AL70,$AN$5:$BC$200,AM70,FALSE))","v":""},null,null,null,null,null,null,{"$f":"IFERROR(IF(Q70=\"1=Syndicated loan, arranger\",\"1=Official institution\",IF(Q70=1,\"1=Official institution\",\"\")),\"\")","v":""},null,null,null,null,null,null,null,null,null,null,null,{"$f":"IFERROR(VLOOKUP(Q70,BE:BF,2,FALSE),\"\")","v":""},{"$f":"AM69+1","v":66},{"$f":"IF(V70>W70,\"B cannot be higher than C\",IF(COUNTA(V70:X70)=0,\"Fill in supplementary fields\",IFERROR(IF(VALUE(LEFT(Z70,1))=1,X70/2+(V70/W70)*(X70/2),IF(VALUE(LEFT(Z70,1))=2,\"impossible combination\",\"check not available\")),\"\")))","v":"Fill in supplementary fields"},{"$f":"IF(V70>W70,\"B cannot be higher than C\",IF(COUNTA(V70:X70)=0,\"Fill in supplementary fields\",IFERROR(IF(VALUE(LEFT(Z70,1))=1,(V70/W70)*(X70/2),IF(VALUE(LEFT(Z70,1))=2,(V70/W70)*(X70),\"check not available\")),\"\")))","v":"Fill in supplementary fields"},{"$f":"IF(V70>W70,\"B cannot be higher than C\",IF(COUNTA(AA70:AB70)=0,\"Fill in supplementary fields\",(X70/2)*(V70/W70)+(X70/2)*(1/SUM(AA70:AB70))))+(IF(LEFT(T70,1)=\"1\",((W70+X70)/AC70)*(V70/(W70+X70))*AD70*AE70*(AC70/(1-AE70)),IF(LEFT(T70,1)=\"2\",IF(COUNTA(V70:X70)=0,\"Fill in supplementary fields\",(W70+X70)*AE70*AD70))))","v":{"$error":"#VALUE!"}},{"$f":"IF(V70>W70,\"B cannot be higher than C\",IFERROR(IF(COUNTA(AA70:AB70)=0,\"Fill in supplementary fields\",X70/2)*(V70/W70)+(X70/2)*(1/AA70),\"Fill in supplementary fields\"))+(IF(LEFT(T70,1)=\"1\",((W70+X70)/AC70)*(V70/(W70+X70))*AD70*AE70*(AC70/(1-AE70)),IF(LEFT(T70,1)=\"2\",IF(COUNTA(V70:X70)=0,\"Fill in supplementary fields\",(W70+X70)*AE70*AD70))))","v":{"$error":"#VALUE!"}},{"$f":"IF(V70>W70,\"B cannot be higher than C\",IFERROR(IF(COUNTA(AA70:AB70)=0,\"Fill in supplementary fields\",IF(AA70=0,X70/2*(V70/W70)+X70/2*(1/AB70),(X70/2)*(V70/W70))),\"Fill in supplementary fields\"))+(IF(LEFT(T70,1)=\"1\",((W70+X70)/AC70)*(V70/(W70+X70))*AD70*AE70*(AC70/(1-AE70)),IF(LEFT(T70,1)=\"2\",IF(COUNTA(V70:X70)=0,\"Fill in supplementary fields\",(W70+X70)*AE70*AD70))))","v":{"$error":"#VALUE!"}},{"$f":"IF(V70>W70,\"B cannot be higher than C\",IF(COUNTA(V70:X70)=0,\"Enter exposure values in fields A and B\",(X70)*(V70/W70)))","v":"Enter exposure values in fields A and B"},{"$f":"IF(V70>W70,\"B cannot be higher than C\",IFERROR(IF(COUNTA(AA70:AB70)=0,\"Fill in supplementary fields\",X70/2)*(V70/W70)+(X70/2)*(1/AA70),\"Fill in supplementary fields\"))","v":"Fill in supplementary fields"},{"$f":"IF(V70>W70,\"B cannot be higher than C\",IFERROR(IF(COUNTA(AA70:AB70)=0,\"Fill in supplementary fields\",IF(AA70=0,X70/2*(V70/W70)+X70/2*(1/AB70),(X70/2)*(V70/W70))),\"Fill in supplementary fields\"))","v":"Fill in supplementary fields"},{"$f":"IF(V70>W70,\"B cannot be higher than C\",IF(COUNTA(V70:X70)=0,\"Fill in supplementary fields\",(V70/W70)*((X70)+AD70*AE70)))","v":"Fill in supplementary fields"},{"$f":"IF(V70>W70,\"B cannot be higher than C\",IF(COUNTA(V70:X70)=0,\"Fill in supplementary fields\",(X70)*(V70/W70)))","v":"Fill in supplementary fields"},{"$f":"$X70","v":0},0,0,0,0,0,0]
[null,null,null,null,null,null,null,null,null,null,null,null,null,null,null,null,null,null,"",null,null,null,null,null,null,"",null,null,null,null,null,null,null,null,null,null,null,"",67,"Fill in supplementary fields","Fill in supplementary fields",{"$error":"#VALUE!"},{"$error":"#VALUE!"},{"$error":"#VALUE!"},"Enter exposure values in fields A and B","Fill in supplementary fields","Fill in supplementary fields","Fill in supplementary fields","Fill in supplementary fields",0,0,0,0,0,0,0]
[null,null,null,null,null,null,null,null,null,null,null,null,null,null,null,null,null,null,"",null,null,null,null,null,null,"",null,null,null,null,null,null,null,null,null,null,null,"",68,"Fill in supplementary fields","Fill in supplementary fields",{"$f":"IF(V72>W72,\"B cannot be higher than C\",IF(COUNTA(AA72:AB72)=0,\"Fill in supplementary fields\",(X72/2)*(V72/W72)+(X72/2)*(1/SUM(AA72:AB72))))+(IF(LEFT(T72,1)=\"1\",((V84*AD84)*(AE84/(1-AE84))),IF(LEFT(T72,1)=\"2\",IF(COUNTA(V72:X72)=0,\"Fill in supplementary fields\",(W72+X72)*AE72*AD72))))","v":{"$error":"#VALUE!"}},{"$f":"IF(V72>W72,\"B cannot be higher than C\",IFERROR(IF(COUNTA(AA72:AB72)=0,\"Fill in supplementary fields\",X72/2)*(V72/W72)+(X72/2)*(1/AA72),\"Fill in supplementary fields\"))+(IF(LEFT(T72,1)=\"1\",((V84*AD84)*(AE84/(1-AE84))),IF(LEFT(T72,1)=\"2\",IF(COUNTA(V72:X72)=0,\"Fill in supplementary fields\",(W72+X72)*AE72*AD72))))","v":{"$error":"#VALUE!"}},{"$f":"IF(V72>W72,\"B cannot be higher than C\",IFERROR(IF(COUNTA(AA72:AB72)=0,\"Fill in supplementary fields\",IF(AA72=0,X72/2*(V72/W72)+X72/2*(1/AB72),(X72/2)*(V72/W72))),\"Fill in supplementary fields\"))+(IF(LEFT(T72,1)=\"1\",((V84*AD84)*(AE84/(1-AE84))),IF(LEFT(T72,1)=\"2\",IF(COUNTA(V72:X72)=0,\"Fill in supplementary fields\",(W72+X72)*AE72*AD72))))","v":{"$error":"#VALUE!"}},"Enter exposure values in fields A and B","Fill in supplementary fields","Fill in supplementary fields","Fill in supplementary fields","Fill in supplementary fields",0,0,0,0,0,0,0]
[null,null,null,null,null,null,null,null,null,null,null,null,null,null,null,null,null,null,"",null,null,null,null,null,null,"",null,null,null,null,null,null,null,null,null,null,null,"",69,"Fill in supplementary fields","Fill in supplementary fields",{"$f":"IF(V73>W73,\"B cannot be higher than C\",IF(COUNTA(AA73:AB73)=0,\"Fill in supplementary fields\",(X73/2)*(V73/W73)+(X73/2)*(1/SUM(AA73:AB73))))+(IF(LEFT(T73,1)=\"1\",((W73+X73)/AC73)*(V73/(W73+X73))*AD73*AE73*(AC73/(1-AE73)),IF(LEFT(T73,1)=\"2\",IF(COUNTA(V73:X73)=0,\"Fill in supplementary fields\",(W73+X73)*AE73*AD73))))","v":{"$error":"#VALUE!"}},{"$f":"IF(V73>W73,\"B cannot be higher than C\",IFERROR(IF(COUNTA(AA73:AB73)=0,\"Fill in supplementary fields\",X73/2)*(V73/W73)+(X73/2)*(1/AA73),\"Fill in supplementary fields\"))+(IF(LEFT(T73,1)=\"1\",((W73+X73)/AC73)*(V73/(W73+X73))*AD73*AE73*(AC73/(1-AE73)),IF(LEFT(T73,1)=\"2\",IF(COUNTA(V73:X73)=0,\"Fill in supplementary fields\",(W73+X73)*AE73*AD73))))","v":{"$error":"#VALUE!"}},{"$f":"IF(V73>W73,\"B cannot be higher than C\",IFERROR(IF(COUNTA(AA73:AB73)=0,\"Fill in supplementary fields\",IF(AA73=0,X73/2*(V73/W73)+X73/2*(1/AB73),(X73/2)*(V73/W73))),\"Fill in supplementary fields\"))+(IF(LEFT(T73,1)=\"1\",((W73+X73)/AC73)*(V73/(W73+X73))*AD73*AE73*(AC73/(1-AE73)),IF(LEFT(T73,1)=\"2\",IF(COUNTA(V73:X73)=0,\"Fill in supplementary fields\",(W73+X73)*AE73*AD73))))","v":{"$error":"#VALUE!"}},"Enter exposure values in fields A and B","Fill in supplementary fields","Fill in supplementary fields","Fill in supplementary fields","Fill in supplementary fields",0,0,0,0,0,0,0]
[null,null,null,null,null,null,null,null,null,null,null,null,null,null,null,null,null,null,"",null,null,null,null,null,null,"",null,null,null,null,null,null,null,null,null,null,null,"",70,"Fill in supplementary fields","Fill in supplementary fields",{"$error":"#VALUE!"},{"$error":"#VALUE!"},{"$error":"#VALUE!"},"Enter exposure values in fields A and B","Fill in supplementary fields","Fill in supplementary fields","Fill in supplementary fields","Fill in supplementary fields",0,0,0,0,0,0,0]
[null,null,null,null,null,null,null,null,null,null,null,null,null,null,null,null,null,null,"",null,null,null,null,null,null,"",null,null,null,null,null,null,null,null,null,null,null,"",71,"Fill in supplementary fields","Fill in supplementary fields",{"$f":"IF(V75>W75,\"B cannot be higher than C\",IF(COUNTA(AA75:AB75)=0,\"Fill in supplementary fields\",(X75/2)*(V75/W75)+(X75/2)*(1/SUM(AA75:AB75))))+(IF(LEFT(T75,1)=\"1\",((V87*AD87)*(AE87/(1-AE87))),IF(LEFT(T75,1)=\"2\",IF(COUNTA(V75:X75)=0,\"Fill in supplementary fields\",(W75+X75)*AE75*AD75))))","v":{"$error":"#VALUE!"}},{"$f":"IF(V75>W75,\"B cannot be higher than C\",IFERROR(IF(COUNTA(AA75:AB75)=0,\"Fill in supplementary fields\",X75/2)*(V75/W75)+(X75/2)*(1/AA75),\"Fill in supplementary fields\"))+(IF(LEFT(T75,1)=\"1\",((V87*AD87)*(AE87/(1-AE87))),IF(LEFT(T75,1)=\"2\",IF(COUNTA(V75:X75)=0,\"Fill in supplementary fields\",(W75+X75)*AE75*AD75))))","v":{"$error":"#VALUE!"}},{"$f":"IF(V75>W75,\"B cannot be higher than C\",IFERROR(IF(COUNTA(AA75:AB75)=0,\"Fill in supplementary fields\",IF(AA75=0,X75/2*(V75/W75)+X75/2*(1/AB75),(X75/2)*(V75/W75))),\"Fill in supplementary fields\"))+(IF(LEFT(T75,1)=\"1\",((V87*AD87)*(AE87/(1-AE87))),IF(LEFT(T75,1)=\"2\",IF(COUNTA(V75:X75)=0,\"Fill in supplementary fields\",(W75+X75)*AE75*AD75))))","v":{"$error":"#VALUE!"}},"Enter exposure values in fields A and B","Fill in supplementary fields","Fill in supplementary fields","Fill in supplementary fields","Fill in supplementary fields",0,0,0,0,0,0,0]
[null,null,null,null,null,null,null,null,null,null,null,null,null,null,null,null,null,null,"",null,null,null,null,null,null,"",null,null,null,null,null,null,null,null,null,null,null,"",72,"Fill in supplementary fields","Fill in supplementary fields",{"$f":"IF(V76>W76,\"B cannot be higher than C\",IF(COUNTA(AA76:AB76)=0,\"Fill in supplementary fields\",(X76/2)*(V76/W76)+(X76/2)*(1/SUM(AA76:AB76))))+(IF(LEFT(T76,1)=\"1\",((W76+X76)/AC76)*(V76/(W76+X76))*AD76*AE76*(AC76/(1-AE76)),IF(LEFT(T76,1)=\"2\",IF(COUNTA(V76:X76)=0,\"Fill in supplementary fields\",(W76+X76)*AE76*AD76))))","v":{"$error":"#VALUE!"}},{"$f":"IF(V76>W76,\"B cannot be higher than C\",IFERROR(IF(COUNTA(AA76:AB76)=0,\"Fill in supplementary fields\",X76/2)*(V76/W76)+(X76/2)*(1/AA76),\"Fill in supplementary fields\"))+(IF(LEFT(T76,1)=\"1\",((W76+X76)/AC76)*(V76/(W76+X76))*AD76*AE76*(AC76/(1-AE76)),IF(LEFT(T76,1)=\"2\",IF(COUNTA(V76:X76)=0,\"Fill in supplementary fields\",(W76+X76)*AE76*AD76))))","v":{"$error":"#VALUE!"}},{"$f":"IF(V76>W76,\"B cannot be higher than C\",IFERROR(IF(COUNTA(AA76:AB76)=0,\"Fill in supplementary fields\",IF(AA76=0,X76/2*(V76/W76)+X76/2*(1/AB76),(X76/2)*(V76/W76))),\"Fill in supplementary fields\"))+(IF(LEFT(T76,1)=\"1\",((W76+X76)/AC76)*(V76/(W76+X76))*AD76*AE76*(AC76/(1-AE76)),IF(LEFT(T76,1)=\"2\",IF(COUNTA(V76:X76)=0,\"Fill in supplementary fields\",(W76+X76)*AE76*AD76))))","v":{"$error":"#VALUE!"}},"Enter exposure values in fields A and B","Fill in supplementary fields","Fill in supplementary fields","Fill in supplementary fields","Fill in supplementary fields",0,0,0,0,0,0,0]
[null,null,null,null,null,null,null,null,null,null,null,null,null,null,null,null,null,null,"",null,null,null,null,null,null,"",null,null,null,null,null,null,null,null,null,null,null,"",73,"Fill in supplementary fields","Fill in supplementary fields",{"$error":"#VALUE!"},{"$error":"#VALUE!"},{"$error":"#VALUE!"},"Enter exposure values in fields A and B","Fill in supplementary fields","Fill in supplementary fields","Fill in supplementary fields","Fill in supplementary fields",0,0,0,0,0,0,0]
[null,null,null,null,null,null,null,null,null,null,null,null,null,null,null,null,null,null,"",null,null,null,null,null,null,"",null,null,null,null,null,null,null,null,null,null,null,"",74,"Fill in supplementary fields","Fill in supplementary fields",{"$f":"IF(V78>W78,\"B cannot be higher than C\",IF(COUNTA(AA78:AB78)=0,\"Fill in supplementary fields\",(X78/2)*(V78/W78)+(X78/2)*(1/SUM(AA78:AB78))))+(IF(LEFT(T78,1)=\"1\",((V90*AD90)*(AE90/(1-AE90))),IF(LEFT(T78,1)=\"2\",IF(COUNTA(V78:X78)=0,\"Fill in supplementary fields\",(W78+X78)*AE78*AD78))))","v":{"$error":"#VALUE!"}},{"$f":"IF(V78>W78,\"B cannot be higher than C\",IFERROR(IF(COUNTA(AA78:AB78)=0,\"Fill in supplementary fields\",X78/2)*(V78/W78)+(X78/2)*(1/AA78),\"Fill in supplementary fields\"))+(IF(LEFT(T78,1)=\"1\",((V90*AD90)*(AE90/(1-AE90))),IF(LEFT(T78,1)=\"2\",IF(COUNTA(V78:X78)=0,\"Fill in supplementary fields\",(W78+X78)*AE78*AD78))))","v":{"$error":"#VALUE!"}},{"$f":"IF(V78>W78,\"B cannot be higher than C\",IFERROR(IF(COUNTA(AA78:AB78)=0,\"Fill in supplementary fields\",IF(AA78=0,X78/2*(V78/W78)+X78/2*(1/AB78),(X78/2)*(V78/W78))),\"Fill in supplementary fields\"))+(IF(LEFT(T78,1)=\"1\",((V90*AD90)*(AE90/(1-AE90))),IF(LEFT(T78,1)=\"2\",IF(COUNTA(V78:X78)=0,\"Fill in supplementary fields\",(W78+X78)*AE78*AD78))))","v":{"$error":"#VALUE!"}},"Enter exposure values in fields A and B","Fill in supplementary fields","Fill in supplementary fields","Fill in supplementary fields","Fill in supplementary fields",0,0,0,0,0,0,0]
[null,null,null,null,null,null,null,null,null,null,null,null,null,null,null,null,null,null,"",null,null,null,null,null,null,"",null,null,null,null,null,null,null,null,null,null,null,"",75,"Fill in supplementary fields","Fill in supplementary fields",{"$f":"IF(V79>W79,\"B cannot be higher than C\",IF(COUNTA(AA79:AB79)=0,\"Fill in supplementary fields\",(X79/2)*(V79/W79)+(X79/2)*(1/SUM(AA79:AB79))))+(IF(LEFT(T79,1)=\"1\",((W79+X79)/AC79)*(V79/(W79+X79))*AD79*AE79*(AC79/(1-AE79)),IF(LEFT(T79,1)=\"2\",IF(COUNTA(V79:X79)=0,\"Fill in supplementary fields\",(W79+X79)*AE79*AD79))))","v":{"$error":"#VALUE!"}},{"$f":"IF(V79>W79,\"B cannot be higher than C\",IFERROR(IF(COUNTA(AA79:AB79)=0,\"Fill in supplementary fields\",X79/2)*(V79/W79)+(X79/2)*(1/AA79),\"Fill in supplementary fields\"))+(IF(LEFT(T79,1)=\"1\",((W79+X79)/AC79)*(V79/(W79+X79))*AD79*AE79*(AC79/(1-AE79)),IF(LEFT(T79,1)=\"2\",IF(COUNTA(V79:X79)=0,\"Fill in supplementary fields\",(W79+X79)*AE79*AD79))))","v":{"$error":"#VALUE!"}},{"$f":"IF(V79>W79,\"B cannot be higher than C\",IFERROR(IF(COUNTA(AA79:AB79)=0,\"Fill in supplementary fields\",IF(AA79=0,X79/2*(V79/W79)+X79/2*(1/AB79),(X79/2)*(V79/W79))),\"Fill in supplementary fields\"))+(IF(LEFT(T79,1)=\"1\",((W79+X79)/AC79)*(V79/(W79+X79))*AD79*AE79*(AC79/(1-AE79)),IF(LEFT(T79,1)=\"2\",IF(COUNTA(V79:X79)=0,\"Fill in supplementary fields\",(W79+X79)*AE79*AD79))))","v":{"$error":"#VALUE!"}},"Enter exposure values in fields A and B","Fill in supplementary fields","Fill in supplementary fields","Fill in supplementary fields","Fill in supplementary fields",0,0,0,0,0,0,0]
[null,null,null,null,null,null,null,null,null,null,null,null,null,null,null,null,null,null,"",null,null,null,null,null,null,"",null,null,null,null,null,null,null,null,null,null,null,"",76,"Fill in supplementary fields","Fill in supplementary fields",{"$error":"#VALUE!"},{"$error":"#VALUE!"},{"$error":"#VALUE!"},"Enter exposure values in fields A and B","Fill in supplementary fields","Fill in supplementary fields","Fill in supplementary fields","Fill in supplementary fields",0,0,0,0,0,0,0]
[null,null,null,null,null,null,null,null,null,null,null,null,null,null,null,null,null,null,"",null,null,null,null,null,null,"",null,null,null,null,null,null,null,null,null,null,null,"",77,"Fill in supplementary fields","Fill in supplementary fields",{"$f":"IF(V81>W81,\"B cannot be higher than C\",IF(COUNTA(AA81:AB81)=0,\"Fill in supplementary fields\",(X81/2)*(V81/W81)+(X81/2)*(1/SUM(AA81:AB81))))+(IF(LEFT(T81,1)=\"1\",((V93*AD93)*(AE93/(1-AE93))),IF(LEFT(T81,1)=\"2\",IF(COUNTA(V81:X81)=0,\"Fill in supplementary fields\",(W81+X81)*AE81*AD81))))","v":{"$error":"#VALUE!"}},{"$f":"IF(V81>W81,\"B cannot be higher than C\",IFERROR(IF(COUNTA(AA81:AB81)=0,\"Fill in supplementary fields\",X81/2)*(V81/W81)+(X81/2)*(1/AA81),\"Fill in supplementary fields\"))+(IF(LEFT(T81,1)=\"1\",((V93*AD93)*(AE93/(1-AE93))),IF(LEFT(T81,1)=\"2\",IF(COUNTA(V81:X81)=0,\"Fill in supplementary fields\",(W81+X81)*AE81*AD81))))","v":{"$error":"#VALUE!"}},{"$f":"IF(V81>W81,\"B cannot be higher than C\",IFERROR(IF(COUNTA(AA81:AB81)=0,\"Fill in supplementary fields\",IF(AA81=0,X81/2*(V81/W81)+X81/2*(1/AB81),(X81/2)*(V81/W81))),\"Fill in supplementary fields\"))+(IF(LEFT(T81,1)=\"1\",((V93*AD93)*(AE93/(1-AE93))),IF(LEFT(T81,1)=\"2\",IF(COUNTA(V81:X81)=0,\"Fill in supplementary fields\",(W81+X81)*AE81*AD81))))","v":{"$error":"#VALUE!"}},"Enter exposure values in fields A and B","Fill in supplementary fields","Fill in supplementary fields","Fill in supplementary fields","Fill in supplementary fields",0,0,0,0,0,0,0]
[null,null,null,null,null,null,null,null,null,null,null,null,null,null,null,null,null,null,"",null,null,null,null,null,null,"",null,null,null,null,null,null,null,null,null,null,null,"",78,"Fill in supplementary fields","Fill in supplementary fields",{"$f":"IF(V82>W82,\"B cannot be higher than C\",IF(COUNTA(AA82:AB82)=0,\"Fill in supplementary fields\",(X82/2)*(V82/W82)+(X82/2)*(1/SUM(AA82:AB82))))+(IF(LEFT(T82,1)=\"1\",((W82+X82)/AC82)*(V82/(W82+X82))*AD82*AE82*(AC82/(1-AE82)),IF(LEFT(T82,1)=\"2\",IF(COUNTA(V82:X82)=0,\"Fill in supplementary fields\",(W82+X82)*AE82*AD82))))","v":{"$error":"#VALUE!"}},{"$f":"IF(V82>W82,\"B cannot be higher than C\",IFERROR(IF(COUNTA(AA82:AB82)=0,\"Fill in supplementary fields\",X82/2)*(V82/W82)+(X82/2)*(1/AA82),\"Fill in supplementary fields\"))+(IF(LEFT(T82,1)=\"1\",((W82+X82)/AC82)*(V82/(W82+X82))*AD82*AE82*(AC82/(1-AE82)),IF(LEFT(T82,1)=\"2\",IF(COUNTA(V82:X82)=0,\"Fill in supplementary fields\",(W82+X82)*AE82*AD82))))","v":{"$error":"#VALUE!"}},{"$f":"IF(V82>W82,\"B cannot be higher than C\",IFERROR(IF(COUNTA(AA82:AB82)=0,\"Fill in supplementary fields\",IF(AA82=0,X82/2*(V82/W82)+X82/2*(1/AB82),(X82/2)*(V82/W82))),\"Fill in supplementary fields\"))+(IF(LEFT(T82,1)=\"1\",((W82+X82)/AC82)*(V82/(W82+X82))*AD82*AE82*(AC82/(1-AE82)),IF(LEFT(T82,1)=\"2\",IF(COUNTA(V82:X82)=0,\"Fill in supplementary fields\",(W82+X82)*AE82*AD82))))","v":{"$error":"#VALUE!"}},"Enter exposure values in fields A and B","Fill in supplementary fields","Fill in supplementary fields","Fill in supplementary fields","Fill in supplementary fields",0,0,0,0,0,0,0]
[null,null,null,null,null,null,null,null,null,null,null,null,null,null,null,null,null,null,"",null,null,null,null,null,null,"",null,null,null,null,null,null,null,null,null,null,null,"",79,"Fill in supplementary fields","Fill in supplementary fields",{"$error":"#VALUE!"},{"$error":"#VALUE!"},{"$error":"#VALUE!"},"Enter exposure values in fields A and B","Fill in supplementary fields","Fill in supplementary fields","Fill in supplementary fields","Fill in supplementary fields",0,0,0,0,0,0,0]
[null,null,null,null,null,null,null,null,null,null,null,null,null,null,null,null,null,null,"",null,null,null,null,null,null,"",null,null,null,null,null,null,null,null,null,null,null,"",80,"Fill in supplementary fields","Fill in supplementary fields",{"$f":"IF(V84>W84,\"B cannot be higher than C\",IF(COUNTA(AA84:AB84)=0,\"Fill in supplementary fields\",(X84/2)*(V84/W84)+(X84/2)*(1/SUM(AA84:AB84))))+(IF(LEFT(T84,1)=\"1\",((V96*AD96)*(AE96/(1-AE96))),IF(LEFT(T84,1)=\"2\",IF(COUNTA(V84:X84)=0,\"Fill in supplementary fields\",(W84+X84)*AE84*AD84))))","v":{"$error":"#VALUE!"}},{"$f":"IF(V84>W84,\"B cannot be higher than C\",IFERROR(IF(COUNTA(AA84:AB84)=0,\"Fill in supplementary fields\",X84/2)*(V84/W84)+(X84/2)*(1/AA84),\"Fill in supplementary fields\"))+(IF(LEFT(T84,1)=\"1\",((V96*AD96)*(AE96/(1-AE96))),IF(LEFT(T84,1)=\"2\",IF(COUNTA(V84:X84)=0,\"Fill in supplementary fields\",(W84+X84)*AE84*AD84))))","v":{"$error":"#VALUE!"}},{"$f":"IF(V84>W84,\"B cannot be higher than C\",IFERROR(IF(COUNTA(AA84:AB84)=0,\"Fill in supplementary fields\",IF(AA84=0,X84/2*(V84/W84)+X84/2*(1/AB84),(X84/2)*(V84/W84))),\"Fill in supplementary fields\"))+(IF(LEFT(T84,1)=\"1\",((V96*AD96)*(AE96/(1-AE96))),IF(LEFT(T84,1)=\"2\",IF(COUNTA(V84:X84)=0,\"Fill in supplementary fields\",(W84+X84)*AE84*AD84))))","v":{"$error":"#VALUE!"}},"Enter exposure values in fields A and B","Fill in supplementary fields","Fill in supplementary fields","Fill in supplementary fields","Fill in supplementary fields",0,0,0,0,0,0,0]
[null,null,null,null,null,null,null,null,null,null,null,null,null,null,null,null,null,null,"",null,null,null,null,null,null,"",null,null,null,null,null,null,null,null,null,null,null,"",81,"Fill in supplementary fields","Fill in supplementary fields",{"$f":"IF(V85>W85,\"B cannot be higher than C\",IF(COUNTA(AA85:AB85)=0,\"Fill in supplementary fields\",(X85/2)*(V85/W85)+(X85/2)*(1/SUM(AA85:AB85))))+(IF(LEFT(T85,1)=\"1\",((W85+X85)/AC85)*(V85/(W85+X85))*AD85*AE85*(AC85/(1-AE85)),IF(LEFT(T85,1)=\"2\",IF(COUNTA(V85:X85)=0,\"Fill in supplementary fields\",(W85+X85)*AE85*AD85))))","v":{"$error":"#VALUE!"}},{"$f":"IF(V85>W85,\"B cannot be higher than C\",IFERROR(IF(COUNTA(AA85:AB85)=0,\"Fill in supplementary fields\",X85/2)*(V85/W85)+(X85/2)*(1/AA85),\"Fill in supplementary fields\"))+(IF(LEFT(T85,1)=\"1\",((W85+X85)/AC85)*(V85/(W85+X85))*AD85*AE85*(AC85/(1-AE85)),IF(LEFT(T85,1)=\"2\",IF(COUNTA(V85:X85)=0,\"Fill in supplementary fields\",(W85+X85)*AE85*AD85))))","v":{"$error":"#VALUE!"}},{"$f":"IF(V85>W85,\"B cannot be higher than C\",IFERROR(IF(COUNTA(AA85:AB85)=0,\"Fill in supplementary fields\",IF(AA85=0,X85/2*(V85/W85)+X85/2*(1/AB85),(X85/2)*(V85/W85))),\"Fill in supplementary fields\"))+(IF(LEFT(T85,1)=\"1\",((W85+X85)/AC85)*(V85/(W85+X85))*AD85*AE85*(AC85/(1-AE85)),IF(LEFT(T85,1)=\"2\",IF(COUNTA(V85:X85)=0,\"Fill in supplementary fields\",(W85+X85)*AE85*AD85))))","v":{"$error":"#VALUE!"}},"Enter exposure values in fields A and B","Fill in supplementary fields","Fill in supplementary fields","Fill in supplementary fields","Fill in supplementary fields",0,0,0,0,0,0,0]
[null,null,null,null,null,null,null,null,null,null,null,null,null,null,null,null,null,null,"",null,null,null,null,null,null,"",null,null,null,null,null,null,null,null,null,null,null,"",82,"Fill in supplementary fields","Fill in supplementary fields",{"$error":"#VALUE!"},{"$error":"#VALUE!"},{"$error":"#VALUE!"},"Enter exposure values in fields A and B","Fill in supplementary fields","Fill in supplementary fields","Fill in supplementary fields","Fill in supplementary fields",{"$f":"$X86","v":0},0,0,0,0,0,0]
[null,null,null,null,null,null,null,null,null,null,null,null,null,null,null,null,null,null,"",null,null,null,null,null,null,"",null,null,null,null,null,null,null,null,null,null,null,"",83,"Fill in supplementary fields","Fill in supplementary fields",{"$f":"IF(V87>W87,\"B cannot be higher than C\",IF(COUNTA(AA87:AB87)=0,\"Fill in supplementary fields\",(X87/2)*(V87/W87)+(X87/2)*(1/SUM(AA87:AB87))))+(IF(LEFT(T87,1)=\"1\",((V99*AD99)*(AE99/(1-AE99))),IF(LEFT(T87,1)=\"2\",IF(COUNTA(V87:X87)=0,\"Fill in supplementary fields\",(W87+X87)*AE87*AD87))))","v":{"$error":"#VALUE!"}},{"$f":"IF(V87>W87,\"B cannot be higher than C\",IFERROR(IF(COUNTA(AA87:AB87)=0,\"Fill in supplementary fields\",X87/2)*(V87/W87)+(X87/2)*(1/AA87),\"Fill in supplementary fields\"))+(IF(LEFT(T87,1)=\"1\",((V99*AD99)*(AE99/(1-AE99))),IF(LEFT(T87,1)=\"2\",IF(COUNTA(V87:X87)=0,\"Fill in supplementary fields\",(W87+X87)*AE87*AD87))))","v":{"$error":"#VALUE!"}},{"$f":"IF(V87>W87,\"B cannot be higher than C\",IFERROR(IF(COUNTA(AA87:AB87)=0,\"Fill in supplementary fields\",IF(AA87=0,X87/2*(V87/W87)+X87/2*(1/AB87),(X87/2)*(V87/W87))),\"Fill in supplementary fields\"))+(IF(LEFT(T87,1)=\"1\",((V99*AD99)*(AE99/(1-AE99))),IF(LEFT(T87,1)=\"2\",IF(COUNTA(V87:X87)=0,\"Fill in supplementary fields\",(W87+X87)*AE87*AD87))))","v":{"$error":"#VALUE!"}},"Enter exposure values in fields A and B","Fill in supplementary fields","Fill in supplementary fields","Fill in supplementary fields","Fill in supplementary fields",0,0,0,0,0,0,0]
[null,null,null,null,null,null,null,null,null,null,null,null,null,null,null,null,null,null,"",null,null,null,null,null,null,"",null,null,null,null,null,null,null,null,null,null,null,"",84,"Fill in supplementary fields","Fill in supplementary fields",{"$f":"IF(V88>W88,\"B cannot be higher than C\",IF(COUNTA(AA88:AB88)=0,\"Fill in supplementary fields\",(X88/2)*(V88/W88)+(X88/2)*(1/SUM(AA88:AB88))))+(IF(LEFT(T88,1)=\"1\",((W88+X88)/AC88)*(V88/(W88+X88))*AD88*AE88*(AC88/(1-AE88)),IF(LEFT(T88,1)=\"2\",IF(COUNTA(V88:X88)=0,\"Fill in supplementary fields\",(W88+X88)*AE88*AD88))))","v":{"$error":"#VALUE!"}},{"$f":"IF(V88>W88,\"B cannot be higher than C\",IFERROR(IF(COUNTA(AA88:AB88)=0,\"Fill in supplementary fields\",X88/2)*(V88/W88)+(X88/2)*(1/AA88),\"Fill in supplementary fields\"))+(IF(LEFT(T88,1)=\"1\",((W88+X88)/AC88)*(V88/(W88+X88))*AD88*AE88*(AC88/(1-AE88)),IF(LEFT(T88,1)=\"2\",IF(COUNTA(V88:X88)=0,\"Fill in supplementary fields\",(W88+X88)*AE88*AD88))))","v":{"$error":"#VALUE!"}},{"$f":"IF(V88>W88,\"B cannot be higher than C\",IFERROR(IF(COUNTA(AA88:AB88)=0,\"Fill in supplementary fields\",IF(AA88=0,X88/2*(V88/W88)+X88/2*(1/AB88),(X88/2)*(V88/W88))),\"Fill in supplementary fields\"))+(IF(LEFT(T88,1)=\"1\",((W88+X88)/AC88)*(V88/(W88+X88))*AD88*AE88*(AC88/(1-AE88)),IF(LEFT(T88,1)=\"2\",IF(COUNTA(V88:X88)=0,\"Fill in supplementary fields\",(W88+X88)*AE88*AD88))))","v":{"$error":"#VALUE!"}},"Enter exposure values in fields A and B","Fill in supplementary fields","Fill in supplementary fields","Fill in supplementary fields","Fill in supplementary fields",0,0,0,0,0,0,0]
[null,null,null,null,null,null,null,null,null,null,null,null,null,null,null,null,null,null,"",null,null,null,null,null,null,"",null,null,null,null,null,null,null,null,null,null,null,"",85,"Fill in supplementary fields","Fill in supplementary fields",{"$error":"#VALUE!"},{"$error":"#VALUE!"},{"$error":"#VALUE!"},"Enter exposure values in fields A and B","Fill in supplementary fields","Fill in supplementary fields","Fill in supplementary fields","Fill in supplementary fields",0,0,0,0,0,0,0]
[null,null,null,null,null,null,null,null,null,null,null,null,null,null,null,null,null,null,"",null,null,null,null,null,null,"",null,null,null,null,null,null,null,null,null,null,null,"",86,"Fill in supplementary fields","Fill in supplementary fields",{"$f":"IF(V90>W90,\"B cannot be higher than C\",IF(COUNTA(AA90:AB90)=0,\"Fill in supplementary fields\",(X90/2)*(V90/W90)+(X90/2)*(1/SUM(AA90:AB90))))+(IF(LEFT(T90,1)=\"1\",((V102*AD102)*(AE102/(1-AE102))),IF(LEFT(T90,1)=\"2\",IF(COUNTA(V90:X90)=0,\"Fill in supplementary fields\",(W90+X90)*AE90*AD90))))","v":{"$error":"#VALUE!"}},{"$f":"IF(V90>W90,\"B cannot be higher than C\",IFERROR(IF(COUNTA(AA90:AB90)=0,\"Fill in supplementary fields\",X90/2)*(V90/W90)+(X90/2)*(1/AA90),\"Fill in supplementary fields\"))+(IF(LEFT(T90,1)=\"1\",((V102*AD102)*(AE102/(1-AE102))),IF(LEFT(T90,1)=\"2\",IF(COUNTA(V90:X90)=0,\"Fill in supplementary fields\",(W90+X90)*AE90*AD90))))","v":{"$error":"#VALUE!"}},{"$f":"IF(V90>W90,\"B cannot be higher than C\",IFERROR(IF(COUNTA(AA90:AB90)=0,\"Fill in supplementary fields\",IF(AA90=0,X90/2*(V90/W90)+X90/2*(1/AB90),(X90/2)*(V90/W90))),\"Fill in supplementary fields\"))+(IF(LEFT(T90,1)=\"1\",((V102*AD102)*(AE102/(1-AE102))),IF(LEFT(T90,1)=\"2\",IF(COUNTA(V90:X90)=0,\"Fill in supplementary fields\",(W90+X90)*AE90*AD90))))","v":{"$error":"#VALUE!"}},"Enter exposure values in fields A and B","Fill in supplementary fields","Fill in supplementary fields","Fill in supplementary fields","Fill in supplementary fields",0,0,0,0,0,0,0]
[null,null,null,null,null,null,null,null,null,null,null,null,null,null,null,null,null,null,"",null,null,null,null,null,null,"",null,null,null,null,null,null,null,null,null,null,null,"",87,"Fill in supplementary fields","Fill in supplementary fields",{"$f":"IF(V91>W91,\"B cannot be higher than C\",IF(COUNTA(AA91:AB91)=0,\"Fill in supplementary fields\",(X91/2)*(V91/W91)+(X91/2)*(1/SUM(AA91:AB91))))+(IF(LEFT(T91,1)=\"1\",((W91+X91)/AC91)*(V91/(W91+X91))*AD91*AE91*(AC91/(1-AE91)),IF(LEFT(T91,1)=\"2\",IF(COUNTA(V91:X91)=0,\"Fill in supplementary fields\",(W91+X91)*AE91*AD91))))","v":{"$error":"#VALUE!"}},{"$f":"IF(V91>W91,\"B cannot be higher than C\",IFERROR(IF(COUNTA(AA91:AB91)=0,\"Fill in supplementary fields\",X91/2)*(V91/W91)+(X91/2)*(1/AA91),\"Fill in supplementary fields\"))+(IF(LEFT(T91,1)=\"1\",((W91+X91)/AC91)*(V91/(W91+X91))*AD91*AE91*(AC91/(1-AE91)),IF(LEFT(T91,1)=\"2\",IF(COUNTA(V91:X91)=0,\"Fill in supplementary fields\",(W91+X91)*AE91*AD91))))","v":{"$error":"#VALUE!"}},{"$f":"IF(V91>W91,\"B cannot be higher than C\",IFERROR(IF(COUNTA(AA91:AB91)=0,\"Fill in supplementary fields\",IF(AA91=0,X91/2*(V91/W91)+X91/2*(1/AB91),(X91/2)*(V91/W91))),\"Fill in supplementary fields\"))+(IF(LEFT(T91,1)=\"1\",((W91+X91)/AC91)*(V91/(W91+X91))*AD91*AE91*(AC91/(1-AE91)),IF(LEFT(T91,1)=\"2\",IF(COUNTA(V91:X91)=0,\"Fill in supplementary fields\",(W91+X91)*AE91*AD91))))","v":{"$error":"#VALUE!"}},"Enter exposure values in fields A and B","Fill in supplementary fields","Fill in supplementary fields","Fill in supplementary fields","Fill in supplementary fields",0,0,0,0,0,0,0]
[null,null,null,null,null,null,null,null,null,null,null,null,null,null,null,null,null,null,"",null,null,null,null,null,null,"",null,null,null,null,null,null,null,null,null,null,null,"",88,"Fill in supplementary fields","Fill in supplementary fields",{"$error":"#VALUE!"},{"$error":"#VALUE!"},{"$error":"#VALUE!"},"Enter exposure values in fields A and B","Fill in supplementary fields","Fill in supplementary fields","Fill in supplementary fields","Fill in supplementary fields",0,0,0,0,0,0,0]
[null,null,null,null,null,null,null,null,null,null,null,null,null,null,null,null,null,null,"",null,null,null,null,null,null,"",null,null,null,null,null,null,null,null,null,null,null,"",89,"Fill in supplementary fields","Fill in supplementary fields",{"$f":"IF(V93>W93,\"B cannot be higher than C\",IF(COUNTA(AA93:AB93)=0,\"Fill in supplementary fields\",(X93/2)*(V93/W93)+(X93/2)*(1/SUM(AA93:AB93))))+(IF(LEFT(T93,1)=\"1\",((V105*AD105)*(AE105/(1-AE105))),IF(LEFT(T93,1)=\"2\",IF(COUNTA(V93:X93)=0,\"Fill in supplementary fields\",(W93+X93)*AE93*AD93))))","v":{"$error":"#VALUE!"}},{"$f":"IF(V93>W93,\"B cannot be higher than C\",IFERROR(IF(COUNTA(AA93:AB93)=0,\"Fill in supplementary fields\",X93/2)*(V93/W93)+(X93/2)*(1/AA93),\"Fill in supplementary fields\"))+(IF(LEFT(T93,1)=\"1\",((V105*AD105)*(AE105/(1-AE105))),IF(LEFT(T93,1)=\"2\",IF(COUNTA(V93:X93)=0,\"Fill in supplementary fields\",(W93+X93)*AE93*AD93))))","v":{"$error":"#VALUE!"}},{"$f":"IF(V93>W93,\"B cannot be higher than C\",IFERROR(IF(COUNTA(AA93:AB93)=0,\"Fill in supplementary fields\",IF(AA93=0,X93/2*(V93/W93)+X93/2*(1/AB93),(X93/2)*(V93/W93))),\"Fill in supplementary fields\"))+(IF(LEFT(T93,1)=\"1\",((V105*AD105)*(AE105/(1-AE105))),IF(LEFT(T93,1)=\"2\",IF(COUNTA(V93:X93)=0,\"Fill in supplementary fields\",(W93+X93)*AE93*AD93))))","v":{"$error":"#VALUE!"}},"Enter exposure values in fields A and B","Fill in supplementary fields","Fill in supplementary fields","Fill in supplementary fields","Fill in supplementary fields",0,0,0,0,0,0,0]
[null,null,null,null,null,null,null,null,null,null,null,null,null,null,null,null,null,null,"",null,null,null,null,null,null,"",null,null,null,null,null,null,null,null,null,null,null,"",90,"Fill in supplementary fields","Fill in supplementary fields",{"$f":"IF(V94>W94,\"B cannot be higher than C\",IF(COUNTA(AA94:AB94)=0,\"Fill in supplementary fields\",(X94/2)*(V94/W94)+(X94/2)*(1/SUM(AA94:AB94))))+(IF(LEFT(T94,1)=\"1\",((W94+X94)/AC94)*(V94/(W94+X94))*AD94*AE94*(AC94/(1-AE94)),IF(LEFT(T94,1)=\"2\",IF(COUNTA(V94:X94)=0,\"Fill in supplementary fields\",(W94+X94)*AE94*AD94))))","v":{"$error":"#VALUE!"}},{"$f":"IF(V94>W94,\"B cannot be higher than C\",IFERROR(IF(COUNTA(AA94:AB94)=0,\"Fill in supplementary fields\",X94/2)*(V94/W94)+(X94/2)*(1/AA94),\"Fill in supplementary fields\"))+(IF(LEFT(T94,1)=\"1\",((W94+X94)/AC94)*(V94/(W94+X94))*AD94*AE94*(AC94/(1-AE94)),IF(LEFT(T94,1)=\"2\",IF(COUNTA(V94:X94)=0,\"Fill in supplementary fields\",(W94+X94)*AE94*AD94))))","v":{"$error":"#VALUE!"}},{"$f":"IF(V94>W94,\"B cannot be higher than C\",IFERROR(IF(COUNTA(AA94:AB94)=0,\"Fill in supplementary fields\",IF(AA94=0,X94/2*(V94/W94)+X94/2*(1/AB94),(X94/2)*(V94/W94))),\"Fill in supplementary fields\"))+(IF(LEFT(T94,1)=\"1\",((W94+X94)/AC94)*(V94/(W94+X94))*AD94*AE94*(AC94/(1-AE94)),IF(LEFT(T94,1)=\"2\",IF(COUNTA(V94:X94)=0,\"Fill in supplementary fields\",(W94+X94)*AE94*AD94))))","v":{"$error":"#VALUE!"}},"Enter exposure values in fields A and B","Fill in supplementary fields","Fill in supplementary fields","Fill in supplementary fields","Fill in supplementary fields",0,0,0,0,0,0,0]
[null,null,null,null,null,null,null,null,null,null,null,null,null,null,null,null,null,null,"",null,null,null,null,null,null,"",null,null,null,null,null,null,null,null,null,null,null,"",91,"Fill in supplementary fields","Fill in supplementary fields",{"$error":"#VALUE!"},{"$error":"#VALUE!"},{"$error":"#VALUE!"},"Enter exposure values in fields A and B","Fill in supplementary fields","Fill in supplementary fields","Fill in supplementary fields","Fill in supplementary fields",0,0,0,0,0,0,0]
[null,null,null,null,null,null,null,null,null,null,null,null,null,null,null,null,null,null,"",null,null,null,null,null,null,"",null,null,null,null,null,null,null,null,null,null,null,"",92,"Fill in supplementary fields","Fill in supplementary fields",{"$f":"IF(V96>W96,\"B cannot be higher than C\",IF(COUNTA(AA96:AB96)=0,\"Fill in supplementary fields\",(X96/2)*(V96/W96)+(X96/2)*(1/SUM(AA96:AB96))))+(IF(LEFT(T96,1)=\"1\",((V108*AD108)*(AE108/(1-AE108))),IF(LEFT(T96,1)=\"2\",IF(COUNTA(V96:X96)=0,\"Fill in supplementary fields\",(W96+X96)*AE96*AD96))))","v":{"$error":"#VALUE!"}},{"$f":"IF(V96>W96,\"B cannot be higher than C\",IFERROR(IF(COUNTA(AA96:AB96)=0,\"Fill in supplementary fields\",X96/2)*(V96/W96)+(X96/2)*(1/AA96),\"Fill in supplementary fields\"))+(IF(LEFT(T96,1)=\"1\",((V108*AD108)*(AE108/(1-AE108))),IF(LEFT(T96,1)=\"2\",IF(COUNTA(V96:X96)=0,\"Fill in supplementary fields\",(W96+X96)*AE96*AD96))))","v":{"$error":"#VALUE!"}},{"$f":"IF(V96>W96,\"B cannot be higher than C\",IFERROR(IF(COUNTA(AA96:AB96)=0,\"Fill in supplementary fields\",IF(AA96=0,X96/2*(V96/W96)+X96/2*(1/AB96),(X96/2)*(V96/W96))),\"Fill in supplementary fields\"))+(IF(LEFT(T96,1)=\"1\",((V108*AD108)*(AE108/(1-AE108))),IF(LEFT(T96,1)=\"2\",IF(COUNTA(V96:X96)=0,\"Fill in supplementary fields\",(W96+X96)*AE96*AD96))))","v":{"$error":"#VALUE!"}},"Enter exposure values in fields A and B","Fill in supplementary fields","Fill in supplementary fields","Fill in supplementary fields","Fill in supplementary fields",0,0,0,0,0,0,0]
[null,null,null,null,null,null,null,null,null,null,null,null,null,null,null,null,null,null,"",null,null,null,null,null,null,"",null,null,null,null,null,null,null,null,null,null,null,"",93,"Fill in supplementary fields","Fill in supplementary fields",{"$f":"IF(V97>W97,\"B cannot be higher than C\",IF(COUNTA(AA97:AB97)=0,\"Fill in supplementary fields\",(X97/2)*(V97/W97)+(X97/2)*(1/SUM(AA97:AB97))))+(IF(LEFT(T97,1)=\"1\",((W97+X97)/AC97)*(V97/(W97+X97))*AD97*AE97*(AC97/(1-AE97)),IF(LEFT(T97,1)=\"2\",IF(COUNTA(V97:X97)=0,\"Fill in supplementary fields\",(W97+X97)*AE97*AD97))))","v":{"$error":"#VALUE!"}},{"$f":"IF(V97>W97,\"B cannot be higher than C\",IFERROR(IF(COUNTA(AA97:AB97)=0,\"Fill in supplementary fields\",X97/2)*(V97/W97)+(X97/2)*(1/AA97),\"Fill in supplementary fields\"))+(IF(LEFT(T97,1)=\"1\",((W97+X97)/AC97)*(V97/(W97+X97))*AD97*AE97*(AC97/(1-AE97)),IF(LEFT(T97,1)=\"2\",IF(COUNTA(V97:X97)=0,\"Fill in supplementary fields\",(W97+X97)*AE97*AD97))))","v":{"$error":"#VALUE!"}},{"$f":"IF(V97>W97,\"B cannot be higher than C\",IFERROR(IF(COUNTA(AA97:AB97)=0,\"Fill in supplementary fields\",IF(AA97=0,X97/2*(V97/W97)+X97/2*(1/AB97),(X97/2)*(V97/W97))),\"Fill in supplementary fields\"))+(IF(LEFT(T97,1)=\"1\",((W97+X97)/AC97)*(V97/(W97+X97))*AD97*AE97*(AC97/(1-AE97)),IF(LEFT(T97,1)=\"2\",IF(COUNTA(V97:X97)=0,\"Fill in supplementary fields\",(W97+X97)*AE97*AD97))))","v":{"$error":"#VALUE!"}},"Enter exposure values in fields A and B","Fill in supplementary fields","Fill in supplementary fields","Fill in supplementary fields","Fill in supplementary fields",0,0,0,0,0,0,0]
[null,null,null,null,null,null,null,null,null,null,null,null,null,null,null,null,null,null,"",null,null,null,null,null,null,"",null,null,null,null,null,null,null,null,null,null,null,"",94,"Fill in supplementary fields","Fill in supplementary fields",{"$error":"#VALUE!"},{"$error":"#VALUE!"},{"$error":"#VALUE!"},"Enter exposure values in fields A and B","Fill in supplementary fields","Fill in supplementary fields","Fill in supplementary fields","Fill in supplementary fields",0,0,0,0,0,0,0]
[null,null,null,null,null,null,null,null,null,null,null,null,null,null,null,null,null,null,"",null,null,null,null,null,null,"",null,null,null,null,null,null,null,null,null,null,null,"",95,"Fill in supplementary fields","Fill in supplementary fields",{"$f":"IF(V99>W99,\"B cannot be higher than C\",IF(COUNTA(AA99:AB99)=0,\"Fill in supplementary fields\",(X99/2)*(V99/W99)+(X99/2)*(1/SUM(AA99:AB99))))+(IF(LEFT(T99,1)=\"1\",((V111*AD111)*(AE111/(1-AE111))),IF(LEFT(T99,1)=\"2\",IF(COUNTA(V99:X99)=0,\"Fill in supplementary fields\",(W99+X99)*AE99*AD99))))","v":{"$error":"#VALUE!"}},{"$f":"IF(V99>W99,\"B cannot be higher than C\",IFERROR(IF(COUNTA(AA99:AB99)=0,\"Fill in supplementary fields\",X99/2)*(V99/W99)+(X99/2)*(1/AA99),\"Fill in supplementary fields\"))+(IF(LEFT(T99,1)=\"1\",((V111*AD111)*(AE111/(1-AE111))),IF(LEFT(T99,1)=\"2\",IF(COUNTA(V99:X99)=0,\"Fill in supplementary fields\",(W99+X99)*AE99*AD99))))","v":{"$error":"#VALUE!"}},{"$f":"IF(V99>W99,\"B cannot be higher than C\",IFERROR(IF(COUNTA(AA99:AB99)=0,\"Fill in supplementary fields\",IF(AA99=0,X99/2*(V99/W99)+X99/2*(1/AB99),(X99/2)*(V99/W99))),\"Fill in supplementary fields\"))+(IF(LEFT(T99,1)=\"1\",((V111*AD111)*(AE111/(1-AE111))),IF(LEFT(T99,1)=\"2\",IF(COUNTA(V99:X99)=0,\"Fill in supplementary fields\",(W99+X99)*AE99*AD99))))","v":{"$error":"#VALUE!"}},"Enter exposure values in fields A and B","Fill in supplementary fields","Fill in supplementary fields","Fill in supplementary fields","Fill in supplementary fields",0,0,0,0,0,0,0]
[null,null,null,null,null,null,null,null,null,null,null,null,null,null,null,null,null,null,"",null,null,null,null,null,null,"",null,null,null,null,null,null,null,null,null,null,null,"",96,"Fill in supplementary fields","Fill in supplementary fields",{"$f":"IF(V100>W100,\"B cannot be higher than C\",IF(COUNTA(AA100:AB100)=0,\"Fill in supplementary fields\",(X100/2)*(V100/W100)+(X100/2)*(1/SUM(AA100:AB100))))+(IF(LEFT(T100,1)=\"1\",((W100+X100)/AC100)*(V100/(W100+X100))*AD100*AE100*(AC100/(1-AE100)),IF(LEFT(T100,1)=\"2\",IF(COUNTA(V100:X100)=0,\"Fill in supplementary fields\",(W100+X100)*AE100*AD100))))","v":{"$error":"#VALUE!"}},{"$f":"IF(V100>W100,\"B cannot be higher than C\",IFERROR(IF(COUNTA(AA100:AB100)=0,\"Fill in supplementary fields\",X100/2)*(V100/W100)+(X100/2)*(1/AA100),\"Fill in supplementary fields\"))+(IF(LEFT(T100,1)=\"1\",((W100+X100)/AC100)*(V100/(W100+X100))*AD100*AE100*(AC100/(1-AE100)),IF(LEFT(T100,1)=\"2\",IF(COUNTA(V100:X100)=0,\"Fill in supplementary fields\",(W100+X100)*AE100*AD100))))","v":{"$error":"#VALUE!"}},{"$f":"IF(V100>W100,\"B cannot be higher than C\",IFERROR(IF(COUNTA(AA100:AB100)=0,\"Fill in supplementary fields\",IF(AA100=0,X100/2*(V100/W100)+X100/2*(1/AB100),(X100/2)*(V100/W100))),\"Fill in supplementary fields\"))+(IF(LEFT(T100,1)=\"1\",((W100+X100)/AC100)*(V100/(W100+X100))*AD100*AE100*(AC100/(1-AE100)),IF(LEFT(T100,1)=\"2\",IF(COUNTA(V100:X100)=0,\"Fill in supplementary fields\",(W100+X100)*AE100*AD100))))","v":{"$error":"#VALUE!"}},"Enter exposure values in fields A and B","Fill in supplementary fields","Fill in supplementary fields","Fill in supplementary fields","Fill in supplementary fields",0,0,0,0,0,0,0]
[null,null,null,null,null,null,null,null,null,null,null,null,null,null,null,null,null,null,"",null,null,null,null,null,null,"",null,null,null,null,null,null,null,null,null,null,null,"",97,"Fill in supplementary fields","Fill in supplementary fields",{"$error":"#VALUE!"},{"$error":"#VALUE!"},{"$error":"#VALUE!"},"Enter exposure values in fields A and B","Fill in supplementary fields","Fill in supplementary fields","Fill in supplementary fields","Fill in supplementary fields",0,0,0,0,0,0,0]
[null,null,null,null,null,null,null,null,null,null,null,null,null,null,null,null,null,null,{"$f":"IF(LEN(Q102)=0,\"\",HLOOKUP(AL102,$AN$5:$BC$200,AM102,FALSE))","v":""},null,null,null,null,null,null,"",null,null,null,null,null,null,null,null,null,null,null,{"$f":"IFERROR(VLOOKUP(Q102,BE:BF,2,FALSE),\"\")","v":""},98,{"$f":"IF(V102>W102,\"B cannot be higher than C\",IF(COUNTA(V102:X102)=0,\"Fill in supplementary fields\",IFERROR(IF(VALUE(LEFT(Z102,1))=1,X102/2+(V102/W102)*(X102/2),IF(VALUE(LEFT(Z102,1))=2,\"impossible combination\",\"check not available\")),\"\")))","v":"Fill in supplementary fields"},{"$f":"IF(V102>W102,\"B cannot be higher than C\",IF(COUNTA(V102:X102)=0,\"Fill in supplementary fields\",IFERROR(IF(VALUE(LEFT(Z102,1))=1,(V102/W102)*(X102/2),IF(VALUE(LEFT(Z102,1))=2,(V102/W102)*(X102),\"check not available\")),\"\")))","v":"Fill in supplementary fields"},{"$f":"IF(V102>W102,\"B cannot be higher than C\",IF(COUNTA(AA102:AB102)=0,\"Fill in supplementary fields\",(X102/2)*(V102/W102)+(X102/2)*(1/SUM(AA102:AB102))))+(IF(LEFT(T102,1)=\"1\",((V114*AD114)*(AE114/(1-AE114))),IF(LEFT(T102,1)=\"2\",IF(COUNTA(V102:X102)=0,\"Fill in supplementary fields\",(W102+X102)*AE102*AD102))))","v":{"$error":"#VALUE!"}},{"$f":"IF(V102>W102,\"B cannot be higher than C\",IFERROR(IF(COUNTA(AA102:AB102)=0,\"Fill in supplementary fields\",X102/2)*(V102/W102)+(X102/2)*(1/AA102),\"Fill in supplementary fields\"))+(IF(LEFT(T102,1)=\"1\",((V114*AD114)*(AE114/(1-AE114))),IF(LEFT(T102,1)=\"2\",IF(COUNTA(V102:X102)=0,\"Fill in supplementary fields\",(W102+X102)*AE102*AD102))))","v":{"$error":"#VALUE!"}},{"$f":"IF(V102>W102,\"B cannot be higher than C\",IFERROR(IF(COUNTA(AA102:AB102)=0,\"Fill in supplementary fields\",IF(AA102=0,X102/2*(V102/W102)+X102/2*(1/AB102),(X102/2)*(V102/W102))),\"Fill in supplementary fields\"))+(IF(LEFT(T102,1)=\"1\",((V114*AD114)*(AE114/(1-AE114))),IF(LEFT(T102,1)=\"2\",IF(COUNTA(V102:X102)=0,\"Fill in supplementary fields\",(W102+X102)*AE102*AD102))))","v":{"$error":"#VALUE!"}},{"$f":"IF(V102>W102,\"B cannot be higher than C\",IF(COUNTA(V102:X102)=0,\"Enter exposure values in fields A and B\",(X102)*(V102/W102)))","v":"Enter exposure values in fields A and B"},{"$f":"IF(V102>W102,\"B cannot be higher than C\",IFERROR(IF(COUNTA(AA102:AB102)=0,\"Fill in supplementary fields\",X102/2)*(V102/W102)+(X102/2)*(1/AA102),\"Fill in supplementary fields\"))","v":"Fill in supplementary fields"},{"$f":"IF(V102>W102,\"B cannot be higher than C\",IFERROR(IF(COUNTA(AA102:AB102)=0,\"Fill in supplementary fields\",IF(AA102=0,X102/2*(V102/W102)+X102/2*(1/AB102),(X102/2)*(V102/W102))),\"Fill in supplementary fields\"))","v":"Fill in supplementary fields"},{"$f":"IF(V102>W102,\"B cannot be higher than C\",IF(COUNTA(V102:X102)=0,\"Fill in supplementary fields\",(V102/W102)*((X102)+AD102*AE102)))","v":"Fill in supplementary fields"},{"$f":"IF(V102>W102,\"B cannot be higher than C\",IF(COUNTA(V102:X102)=0,\"Fill in supplementary fields\",(X102)*(V102/W102)))","v":"Fill in supplementary fields"},{"$f":"$X102","v":0},0,0,0,0,0,0]
[null,null,null,null,null,null,null,null,null,null,null,null,null,null,null,null,null,null,"",null,null,null,null,null,null,"",null,null,null,null,null,null,null,null,null,null,null,"",99,"Fill in supplementary fields","Fill in supplementary fields",{"$f":"IF(V103>W103,\"B cannot be higher than C\",IF(COUNTA(AA103:AB103)=0,\"Fill in supplementary fields\",(X103/2)*(V103/W103)+(X103/2)*(1/SUM(AA103:AB103))))+(IF(LEFT(T103,1)=\"1\",((W103+X103)/AC103)*(V103/(W103+X103))*AD103*AE103*(AC103/(1-AE103)),IF(LEFT(T103,1)=\"2\",IF(COUNTA(V103:X103)=0,\"Fill in supplementary fields\",(W103+X103)*AE103*AD103))))","v":{"$error":"#VALUE!"}},{"$f":"IF(V103>W103,\"B cannot be higher than C\",IFERROR(IF(COUNTA(AA103:AB103)=0,\"Fill in supplementary fields\",X103/2)*(V103/W103)+(X103/2)*(1/AA103),\"Fill in supplementary fields\"))+(IF(LEFT(T103,1)=\"1\",((W103+X103)/AC103)*(V103/(W103+X103))*AD103*AE103*(AC103/(1-AE103)),IF(LEFT(T103,1)=\"2\",IF(COUNTA(V103:X103)=0,\"Fill in supplementary fields\",(W103+X103)*AE103*AD103))))","v":{"$error":"#VALUE!"}},{"$f":"IF(V103>W103,\"B cannot be higher than C\",IFERROR(IF(COUNTA(AA103:AB103)=0,\"Fill in supplementary fields\",IF(AA103=0,X103/2*(V103/W103)+X103/2*(1/AB103),(X103/2)*(V103/W103))),\"Fill in supplementary fields\"))+(IF(LEFT(T103,1)=\"1\",((W103+X103)/AC103)*(V103/(W103+X103))*AD103*AE103*(AC103/(1-AE103)),IF(LEFT(T103,1)=\"2\",IF(COUNTA(V103:X103)=0,\"Fill in supplementary fields\",(W103+X103)*AE103*AD103))))","v":{"$error":"#VALUE!"}},"Enter exposure values in fields A and B","Fill in supplementary fields","Fill in supplementary fields","Fill in supplementary fields","Fill in supplementary fields",0,0,0,0,0,0,0]
[null,null,null,null,null,null,null,null,null,null,null,null,null,null,null,null,null,null,"",null,null,null,null,null,null,"",null,null,null,null,null,null,null,null,null,null,null,"",100,"Fill in supplementary fields","Fill in supplementary fields",{"$error":"#VALUE!"},{"$error":"#VALUE!"},{"$error":"#VALUE!"},"Enter exposure values in fields A and B","Fill in supplementary fields","Fill in supplementary fields","Fill in supplementary fields","Fill in supplementary fields",0,0,0,0,0,0,0]
[null,null,null,null,null,null,null,null,null,null,null,null,null,null,null,null,null,null,"",null,null,null,null,null,null,"",null,null,null,null,null,null,null,null,null,null,null,"",101,"Fill in supplementary fields","Fill in supplementary fields",{"$f":"IF(V105>W105,\"B cannot be higher than C\",IF(COUNTA(AA105:AB105)=0,\"Fill in supplementary fields\",(X105/2)*(V105/W105)+(X105/2)*(1/SUM(AA105:AB105))))+(IF(LEFT(T105,1)=\"1\",((V117*AD117)*(AE117/(1-AE117))),IF(LEFT(T105,1)=\"2\",IF(COUNTA(V105:X105)=0,\"Fill in supplementary fields\",(W105+X105)*AE105*AD105))))","v":{"$error":"#VALUE!"}},{"$f":"IF(V105>W105,\"B cannot be higher than C\",IFERROR(IF(COUNTA(AA105:AB105)=0,\"Fill in supplementary fields\",X105/2)*(V105/W105)+(X105/2)*(1/AA105),\"Fill in supplementary fields\"))+(IF(LEFT(T105,1)=\"1\",((V117*AD117)*(AE117/(1-AE117))),IF(LEFT(T105,1)=\"2\",IF(COUNTA(V105:X105)=0,\"Fill in supplementary fields\",(W105+X105)*AE105*AD105))))","v":{"$error":"#VALUE!"}},{"$f":"IF(V105>W105,\"B cannot be higher than C\",IFERROR(IF(COUNTA(AA105:AB105)=0,\"Fill in supplementary fields\",IF(AA105=0,X105/2*(V105/W105)+X105/2*(1/AB105),(X105/2)*(V105/W105))),\"Fill in supplementary fields\"))+(IF(LEFT(T105,1)=\"1\",((V117*AD117)*(AE117/(1-AE117))),IF(LEFT(T105,1)=\"2\",IF(COUNTA(V105:X105)=0,\"Fill in supplementary fields\",(W105+X105)*AE105*AD105))))","v":{"$error":"#VALUE!"}},"Enter exposure values in fields A and B","Fill in supplementary fields","Fill in supplementary fields","Fill in supplementary fields","Fill in supplementary fields",0,0,0,0,0,0,0]
[null,null,null,null,null,null,null,null,null,null,null,null,null,null,null,null,null,null,"",null,null,null,null,null,null,"",null,null,null,null,null,null,null,null,null,null,null,"",102,"Fill in supplementary fields","Fill in supplementary fields",{"$f":"IF(V106>W106,\"B cannot be higher than C\",IF(COUNTA(AA106:AB106)=0,\"Fill in supplementary fields\",(X106/2)*(V106/W106)+(X106/2)*(1/SUM(AA106:AB106))))+(IF(LEFT(T106,1)=\"1\",((W106+X106)/AC106)*(V106/(W106+X106))*AD106*AE106*(AC106/(1-AE106)),IF(LEFT(T106,1)=\"2\",IF(COUNTA(V106:X106)=0,\"Fill in supplementary fields\",(W106+X106)*AE106*AD106))))","v":{"$error":"#VALUE!"}},{"$f":"IF(V106>W106,\"B cannot be higher than C\",IFERROR(IF(COUNTA(AA106:AB106)=0,\"Fill in supplementary fields\",X106/2)*(V106/W106)+(X106/2)*(1/AA106),\"Fill in supplementary fields\"))+(IF(LEFT(T106,1)=\"1\",((W106+X106)/AC106)*(V106/(W106+X106))*AD106*AE106*(AC106/(1-AE106)),IF(LEFT(T106,1)=\"2\",IF(COUNTA(V106:X106)=0,\"Fill in supplementary fields\",(W106+X106)*AE106*AD106))))","v":{"$error":"#VALUE!"}},{"$f":"IF(V106>W106,\"B cannot be higher than C\",IFERROR(IF(COUNTA(AA106:AB106)=0,\"Fill in supplementary fields\",IF(AA106=0,X106/2*(V106/W106)+X106/2*(1/AB106),(X106/2)*(V106/W106))),\"Fill in supplementary fields\"))+(IF(LEFT(T106,1)=\"1\",((W106+X106)/AC106)*(V106/(W106+X106))*AD106*AE106*(AC106/(1-AE106)),IF(LEFT(T106,1)=\"2\",IF(COUNTA(V106:X106)=0,\"Fill in supplementary fields\",(W106+X106)*AE106*AD106))))","v":{"$error":"#VALUE!"}},"Enter exposure values in fields A and B","Fill in supplementary fields","Fill in supplementary fields","Fill in supplementary fields","Fill in supplementary fields",0,0,0,0,0,0,0]
[null,null,null,null,null,null,null,null,null,null,null,null,null,null,null,null,null,null,"",null,null,null,null,null,null,"",null,null,null,null,null,null,null,null,null,null,null,"",103,"Fill in supplementary fields","Fill in supplementary fields",{"$error":"#VALUE!"},{"$error":"#VALUE!"},{"$error":"#VALUE!"},"Enter exposure values in fields A and B","Fill in supplementary fields","Fill in supplementary fields","Fill in supplementary fields","Fill in supplementary fields",0,0,0,0,0,0,0]
[null,null,null,null,null,null,null,null,null,null,null,null,null,null,null,null,null,null,"",null,null,null,null,null,null,"",null,null,null,null,null,null,null,null,null,null,null,"",104,"Fill in supplementary fields","Fill in supplementary fields",{"$f":"IF(V108>W108,\"B cannot be higher than C\",IF(COUNTA(AA108:AB108)=0,\"Fill in supplementary fields\",(X108/2)*(V108/W108)+(X108/2)*(1/SUM(AA108:AB108))))+(IF(LEFT(T108,1)=\"1\",((V120*AD120)*(AE120/(1-AE120))),IF(LEFT(T108,1)=\"2\",IF(COUNTA(V108:X108)=0,\"Fill in supplementary fields\",(W108+X108)*AE108*AD108))))","v":{"$error":"#VALUE!"}},{"$f":"IF(V108>W108,\"B cannot be higher than C\",IFERROR(IF(COUNTA(AA108:AB108)=0,\"Fill in supplementary fields\",X108/2)*(V108/W108)+(X108/2)*(1/AA108),\"Fill in supplementary fields\"))+(IF(LEFT(T108,1)=\"1\",((V120*AD120)*(AE120/(1-AE120))),IF(LEFT(T108,1)=\"2\",IF(COUNTA(V108:X108)=0,\"Fill in supplementary fields\",(W108+X108)*AE108*AD108))))","v":{"$error":"#VALUE!"}},{"$f":"IF(V108>W108,\"B cannot be higher than C\",IFERROR(IF(COUNTA(AA108:AB108)=0,\"Fill in supplementary fields\",IF(AA108=0,X108/2*(V108/W108)+X108/2*(1/AB108),(X108/2)*(V108/W108))),\"Fill in supplementary fields\"))+(IF(LEFT(T108,1)=\"1\",((V120*AD120)*(AE120/(1-AE120))),IF(LEFT(T108,1)=\"2\",IF(COUNTA(V108:X108)=0,\"Fill in supplementary fields\",(W108+X108)*AE108*AD108))))","v":{"$error":"#VALUE!"}},"Enter exposure values in fields A and B","Fill in supplementary fields","Fill in supplementary fields","Fill in supplementary fields","Fill in supplementary fields",0,0,0,0,0,0,0]
[null,null,null,null,null,null,null,null,null,null,null,null,null,null,null,null,null,null,"",null,null,null,null,null,null,"",null,null,null,null,null,null,null,null,null,null,null,"",105,"Fill in supplementary fields","Fill in supplementary fields",{"$f":"IF(V109>W109,\"B cannot be higher than C\",IF(COUNTA(AA109:AB109)=0,\"Fill in supplementary fields\",(X109/2)*(V109/W109)+(X109/2)*(1/SUM(AA109:AB109))))+(IF(LEFT(T109,1)=\"1\",((W109+X109)/AC109)*(V109/(W109+X109))*AD109*AE109*(AC109/(1-AE109)),IF(LEFT(T109,1)=\"2\",IF(COUNTA(V109:X109)=0,\"Fill in supplementary fields\",(W109+X109)*AE109*AD109))))","v":{"$error":"#VALUE!"}},{"$f":"IF(V109>W109,\"B cannot be higher than C\",IFERROR(IF(COUNTA(AA109:AB109)=0,\"Fill in supplementary fields\",X109/2)*(V109/W109)+(X109/2)*(1/AA109),\"Fill in supplementary fields\"))+(IF(LEFT(T109,1)=\"1\",((W109+X109)/AC109)*(V109/(W109+X109))*AD109*AE109*(AC109/(1-AE109)),IF(LEFT(T109,1)=\"2\",IF(COUNTA(V109:X109)=0,\"Fill in supplementary fields\",(W109+X109)*AE109*AD109))))","v":{"$error":"#VALUE!"}},{"$f":"IF(V109>W109,\"B cannot be higher than C\",IFERROR(IF(COUNTA(AA109:AB109)=0,\"Fill in supplementary fields\",IF(AA109=0,X109/2*(V109/W109)+X109/2*(1/AB109),(X109/2)*(V109/W109))),\"Fill in supplementary fields\"))+(IF(LEFT(T109,1)=\"1\",((W109+X109)/AC109)*(V109/(W109+X109))*AD109*AE109*(AC109/(1-AE109)),IF(LEFT(T109,1)=\"2\",IF(COUNTA(V109:X109)=0,\"Fill in supplementary fields\",(W109+X109)*AE109*AD109))))","v":{"$error":"#VALUE!"}},"Enter exposure values in fields A and B","Fill in supplementary fields","Fill in supplementary fields","Fill in supplementary fields","Fill in supplementary fields",0,0,0,0,0,0,0]
[null,null,null,null,null,null,null,null,null,null,null,null,null,null,null,null,null,null,"",null,null,null,null,null,null,"",null,null,null,null,null,null,null,null,null,null,null,"",106,"Fill in supplementary fields","Fill in supplementary fields",{"$error":"#VALUE!"},{"$error":"#VALUE!"},{"$error":"#VALUE!"},"Enter exposure values in fields A and B","Fill in supplementary fields","Fill in supplementary fields","Fill in supplementary fields","Fill in supplementary fields",0,0,0,0,0,0,0]
[null,null,null,null,null,null,null,null,null,null,null,null,null,null,null,null,null,null,"",null,null,null,null,null,null,"",null,null,null,null,null,null,null,null,null,null,null,"",107,"Fill in supplementary fields","Fill in supplementary fields",{"$f":"IF(V111>W111,\"B cannot be higher than C\",IF(COUNTA(AA111:AB111)=0,\"Fill in supplementary fields\",(X111/2)*(V111/W111)+(X111/2)*(1/SUM(AA111:AB111))))+(IF(LEFT(T111,1)=\"1\",((V123*AD123)*(AE123/(1-AE123))),IF(LEFT(T111,1)=\"2\",IF(COUNTA(V111:X111)=0,\"Fill in supplementary fields\",(W111+X111)*AE111*AD111))))","v":{"$error":"#VALUE!"}},{"$f":"IF(V111>W111,\"B cannot be higher than C\",IFERROR(IF(COUNTA(AA111:AB111)=0,\"Fill in supplementary fields\",X111/2)*(V111/W111)+(X111/2)*(1/AA111),\"Fill in supplementary fields\"))+(IF(LEFT(T111,1)=\"1\",((V123*AD123)*(AE123/(1-AE123))),IF(LEFT(T111,1)=\"2\",IF(COUNTA(V111:X111)=0,\"Fill in supplementary fields\",(W111+X111)*AE111*AD111))))","v":{"$error":"#VALUE!"}},{"$f":"IF(V111>W111,\"B cannot be higher than C\",IFERROR(IF(COUNTA(AA111:AB111)=0,\"Fill in supplementary fields\",IF(AA111=0,X111/2*(V111/W111)+X111/2*(1/AB111),(X111/2)*(V111/W111))),\"Fill in supplementary fields\"))+(IF(LEFT(T111,1)=\"1\",((V123*AD123)*(AE123/(1-AE123))),IF(LEFT(T111,1)=\"2\",IF(COUNTA(V111:X111)=0,\"Fill in supplementary fields\",(W111+X111)*AE111*AD111))))","v":{"$error":"#VALUE!"}},"Enter exposure values in fields A and B","Fill in supplementary fields","Fill in supplementary fields","Fill in supplementary fields","Fill in supplementary fields",0,0,0,0,0,0,0]
[null,null,null,null,null,null,null,null,null,null,null,null,null,null,null,null,null,null,"",null,null,null,null,null,null,"",null,null,null,null,null,null,null,null,null,null,null,"",108,"Fill in supplementary fields","Fill in supplementary fields",{"$f":"IF(V112>W112,\"B cannot be higher than C\",IF(COUNTA(AA112:AB112)=0,\"Fill in supplementary fields\",(X112/2)*(V112/W112)+(X112/2)*(1/SUM(AA112:AB112))))+(IF(LEFT(T112,1)=\"1\",((W112+X112)/AC112)*(V112/(W112+X112))*AD112*AE112*(AC112/(1-AE112)),IF(LEFT(T112,1)=\"2\",IF(COUNTA(V112:X112)=0,\"Fill in supplementary fields\",(W112+X112)*AE112*AD112))))","v":{"$error":"#VALUE!"}},{"$f":"IF(V112>W112,\"B cannot be higher than C\",IFERROR(IF(COUNTA(AA112:AB112)=0,\"Fill in supplementary fields\",X112/2)*(V112/W112)+(X112/2)*(1/AA112),\"Fill in supplementary fields\"))+(IF(LEFT(T112,1)=\"1\",((W112+X112)/AC112)*(V112/(W112+X112))*AD112*AE112*(AC112/(1-AE112)),IF(LEFT(T112,1)=\"2\",IF(COUNTA(V112:X112)=0,\"Fill in supplementary fields\",(W112+X112)*AE112*AD112))))","v":{"$error":"#VALUE!"}},{"$f":"IF(V112>W112,\"B cannot be higher than C\",IFERROR(IF(COUNTA(AA112:AB112)=0,\"Fill in supplementary fields\",IF(AA112=0,X112/2*(V112/W112)+X112/2*(1/AB112),(X112/2)*(V112/W112))),\"Fill in supplementary fields\"))+(IF(LEFT(T112,1)=\"1\",((W112+X112)/AC112)*(V112/(W112+X112))*AD112*AE112*(AC112/(1-AE112)),IF(LEFT(T112,1)=\"2\",IF(COUNTA(V112:X112)=0,\"Fill in supplementary fields\",(W112+X112)*AE112*AD112))))","v":{"$error":"#VALUE!"}},"Enter exposure values in fields A and B","Fill in supplementary fields","Fill in supplementary fields","Fill in supplementary fields","Fill in supplementary fields",0,0,0,0,0,0,0]
[null,null,null,null,null,null,null,null,null,null,null,null,null,null,null,null,null,null,"",null,null,null,null,null,null,"",null,null,null,null,null,null,null,null,null,null,null,"",109,"Fill in supplementary fields","Fill in supplementary fields",{"$error":"#VALUE!"},{"$error":"#VALUE!"},{"$error":"#VALUE!"},"Enter exposure values in fields A and B","Fill in supplementary fields","Fill in supplementary fields","Fill in supplementary fields","Fill in supplementary fields",0,0,0,0,0,0,0]
[null,null,null,null,null,null,null,null,null,null,null,null,null,null,null,null,null,null,"",null,null,null,null,null,null,"",null,null,null,null,null,null,null,null,null,null,null,"",110,"Fill in supplementary fields","Fill in supplementary fields",{"$f":"IF(V114>W114,\"B cannot be higher than C\",IF(COUNTA(AA114:AB114)=0,\"Fill in supplementary fields\",(X114/2)*(V114/W114)+(X114/2)*(1/SUM(AA114:AB114))))+(IF(LEFT(T114,1)=\"1\",((V126*AD126)*(AE126/(1-AE126))),IF(LEFT(T114,1)=\"2\",IF(COUNTA(V114:X114)=0,\"Fill in supplementary fields\",(W114+X114)*AE114*AD114))))","v":{"$error":"#VALUE!"}},{"$f":"IF(V114>W114,\"B cannot be higher than C\",IFERROR(IF(COUNTA(AA114:AB114)=0,\"Fill in supplementary fields\",X114/2)*(V114/W114)+(X114/2)*(1/AA114),\"Fill in supplementary fields\"))+(IF(LEFT(T114,1)=\"1\",((V126*AD126)*(AE126/(1-AE126))),IF(LEFT(T114,1)=\"2\",IF(COUNTA(V114:X114)=0,\"Fill in supplementary fields\",(W114+X114)*AE114*AD114))))","v":{"$error":"#VALUE!"}},{"$f":"IF(V114>W114,\"B cannot be higher than C\",IFERROR(IF(COUNTA(AA114:AB114)=0,\"Fill in supplementary fields\",IF(AA114=0,X114/2*(V114/W114)+X114/2*(1/AB114),(X114/2)*(V114/W114))),\"Fill in supplementary fields\"))+(IF(LEFT(T114,1)=\"1\",((V126*AD126)*(AE126/(1-AE126))),IF(LEFT(T114,1)=\"2\",IF(COUNTA(V114:X114)=0,\"Fill in supplementary fields\",(W114+X114)*AE114*AD114))))","v":{"$error":"#VALUE!"}},"Enter exposure values in fields A and B","Fill in supplementary fields","Fill in supplementary fields","Fill in supplementary fields","Fill in supplementary fields",0,0,0,0,0,0,0]
[null,null,null,null,null,null,null,null,null,null,null,null,null,null,null,null,null,null,"",null,null,null,null,null,null,"",null,null,null,null,null,null,null,null,null,null,null,"",111,"Fill in supplementary fields","Fill in supplementary fields",{"$f":"IF(V115>W115,\"B cannot be higher than C\",IF(COUNTA(AA115:AB115)=0,\"Fill in supplementary fields\",(X115/2)*(V115/W115)+(X115/2)*(1/SUM(AA115:AB115))))+(IF(LEFT(T115,1)=\"1\",((W115+X115)/AC115)*(V115/(W115+X115))*AD115*AE115*(AC115/(1-AE115)),IF(LEFT(T115,1)=\"2\",IF(COUNTA(V115:X115)=0,\"Fill in supplementary fields\",(W115+X115)*AE115*AD115))))","v":{"$error":"#VALUE!"}},{"$f":"IF(V115>W115,\"B cannot be higher than C\",IFERROR(IF(COUNTA(AA115:AB115)=0,\"Fill in supplementary fields\",X115/2)*(V115/W115)+(X115/2)*(1/AA115),\"Fill in supplementary fields\"))+(IF(LEFT(T115,1)=\"1\",((W115+X115)/AC115)*(V115/(W115+X115))*AD115*AE115*(AC115/(1-AE115)),IF(LEFT(T115,1)=\"2\",IF(COUNTA(V115:X115)=0,\"Fill in supplementary fields\",(W115+X115)*AE115*AD115))))","v":{"$error":"#VALUE!"}},{"$f":"IF(V115>W115,\"B cannot be higher than C\",IFERROR(IF(COUNTA(AA115:AB115)=0,\"Fill in supplementary fields\",IF(AA115=0,X115/2*(V115/W115)+X115/2*(1/AB115),(X115/2)*(V115/W115))),\"Fill in supplementary fields\"))+(IF(LEFT(T115,1)=\"1\",((W115+X115)/AC115)*(V115/(W115+X115))*AD115*AE115*(AC115/(1-AE115)),IF(LEFT(T115,1)=\"2\",IF(COUNTA(V115:X115)=0,\"Fill in supplementary fields\",(W115+X115)*AE115*AD115))))","v":{"$error":"#VALUE!"}},"Enter exposure values in fields A and B","Fill in supplementary fields","Fill in supplementary fields","Fill in supplementary fields","Fill in supplementary fields",0,0,0,0,0,0,0]
[null,null,null,null,null,null,null,null,null,null,null,null,null,null,null,null,null,null,"",null,null,null,null,null,null,"",null,null,null,null,null,null,null,null,null,null,null,"",112,"Fill in supplementary fields","Fill in supplementary fields",{"$error":"#VALUE!"},{"$error":"#VALUE!"},{"$error":"#VALUE!"},"Enter exposure values in fields A and B","Fill in supplementary fields","Fill in supplementary fields","Fill in supplementary fields","Fill in supplementary fields",0,0,0,0,0,0,0]
[null,null,null,null,null,null,null,null,null,null,null,null,null,null,null,null,null,null,"",null,null,null,null,null,null,"",null,null,null,null,null,null,null,null,null,null,null,"",113,"Fill in supplementary fields","Fill in supplementary fields",{"$f":"IF(V117>W117,\"B cannot be higher than C\",IF(COUNTA(AA117:AB117)=0,\"Fill in supplementary fields\",(X117/2)*(V117/W117)+(X117/2)*(1/SUM(AA117:AB117))))+(IF(LEFT(T117,1)=\"1\",((V129*AD129)*(AE129/(1-AE129))),IF(LEFT(T117,1)=\"2\",IF(COUNTA(V117:X117)=0,\"Fill in supplementary fields\",(W117+X117)*AE117*AD117))))","v":{"$error":"#VALUE!"}},{"$f":"IF(V117>W117,\"B cannot be higher than C\",IFERROR(IF(COUNTA(AA117:AB117)=0,\"Fill in supplementary fields\",X117/2)*(V117/W117)+(X117/2)*(1/AA117),\"Fill in supplementary fields\"))+(IF(LEFT(T117,1)=\"1\",((V129*AD129)*(AE129/(1-AE129))),IF(LEFT(T117,1)=\"2\",IF(COUNTA(V117:X117)=0,\"Fill in supplementary fields\",(W117+X117)*AE117*AD117))))","v":{"$error":"#VALUE!"}},{"$f":"IF(V117>W117,\"B cannot be higher than C\",IFERROR(IF(COUNTA(AA117:AB117)=0,\"Fill in supplementary fields\",IF(AA117=0,X117/2*(V117/W117)+X117/2*(1/AB117),(X117/2)*(V117/W117))),\"Fill in supplementary fields\"))+(IF(LEFT(T117,1)=\"1\",((V129*AD129)*(AE129/(1-AE129))),IF(LEFT(T117,1)=\"2\",IF(COUNTA(V117:X117)=0,\"Fill in supplementary fields\",(W117+X117)*AE117*AD117))))","v":{"$error":"#VALUE!"}},"Enter exposure values in fields A and B","Fill in supplementary fields","Fill in supplementary fields","Fill in supplementary fields","Fill in supplementary fields",0,0,0,0,0,0,0]
[null,null,null,null,null,null,null,null,null,null,null,null,null,null,null,null,null,null,"",null,null,null,null,null,null,"",null,null,null,null,null,null,null,null,null,null,null,"",114,"Fill in supplementary fields","Fill in supplementary fields",{"$f":"IF(V118>W118,\"B cannot be higher than C\",IF(COUNTA(AA118:AB118)=0,\"Fill in supplementary fields\",(X118/2)*(V118/W118)+(X118/2)*(1/SUM(AA118:AB118))))+(IF(LEFT(T118,1)=\"1\",((W118+X118)/AC118)*(V118/(W118+X118))*AD118*AE118*(AC118/(1-AE118)),IF(LEFT(T118,1)=\"2\",IF(COUNTA(V118:X118)=0,\"Fill in supplementary fields\",(W118+X118)*AE118*AD118))))","v":{"$error":"#VALUE!"}},{"$f":"IF(V118>W118,\"B cannot be higher than C\",IFERROR(IF(COUNTA(AA118:AB118)=0,\"Fill in supplementary fields\",X118/2)*(V118/W118)+(X118/2)*(1/AA118),\"Fill in supplementary fields\"))+(IF(LEFT(T118,1)=\"1\",((W118+X118)/AC118)*(V118/(W118+X118))*AD118*AE118*(AC118/(1-AE118)),IF(LEFT(T118,1)=\"2\",IF(COUNTA(V118:X118)=0,\"Fill in supplementary fields\",(W118+X118)*AE118*AD118))))","v":{"$error":"#VALUE!"}},{"$f":"IF(V118>W118,\"B cannot be higher than C\",IFERROR(IF(COUNTA(AA118:AB118)=0,\"Fill in supplementary fields\",IF(AA118=0,X118/2*(V118/W118)+X118/2*(1/AB118),(X118/2)*(V118/W118))),\"Fill in supplementary fields\"))+(IF(LEFT(T118,1)=\"1\",((W118+X118)/AC118)*(V118/(W118+X118))*AD118*AE118*(AC118/(1-AE118)),IF(LEFT(T118,1)=\"2\",IF(COUNTA(V118:X118)=0,\"Fill in supplementary fields\",(W118+X118)*AE118*AD118))))","v":{"$error":"#VALUE!"}},"Enter exposure values in fields A and B","Fill in supplementary fields","Fill in supplementary fields","Fill in supplementary fields","Fill in supplementary fields",{"$f":"$X118","v":0},0,0,0,0,0,0]
[null,null,null,null,null,null,null,null,null,null,null,null,null,null,null,null,null,null,"",null,null,null,null,null,null,"",null,null,null,null,null,null,null,null,null,null,null,"",115,"Fill in supplementary fields","Fill in supplementary fields",{"$error":"#VALUE!"},{"$error":"#VALUE!"},{"$error":"#VALUE!"},"Enter exposure values in fields A and B","Fill in supplementary fields","Fill in supplementary fields","Fill in supplementary fields","Fill in supplementary fields",0,0,0,0,0,0,0]
[null,null,null,null,null,null,null,null,null,null,null,null,null,null,null,null,null,null,"",null,null,null,null,null,null,"",null,null,null,null,null,null,null,null,null,null,null,"",116,"Fill in supplementary fields","Fill in supplementary fields",{"$f":"IF(V120>W120,\"B cannot be higher than C\",IF(COUNTA(AA120:AB120)=0,\"Fill in supplementary fields\",(X120/2)*(V120/W120)+(X120/2)*(1/SUM(AA120:AB120))))+(IF(LEFT(T120,1)=\"1\",((V132*AD132)*(AE132/(1-AE132))),IF(LEFT(T120,1)=\"2\",IF(COUNTA(V120:X120)=0,\"Fill in supplementary fields\",(W120+X120)*AE120*AD120))))","v":{"$error":"#VALUE!"}},{"$f":"IF(V120>W120,\"B cannot be higher than C\",IFERROR(IF(COUNTA(AA120:AB120)=0,\"Fill in supplementary fields\",X120/2)*(V120/W120)+(X120/2)*(1/AA120),\"Fill in supplementary fields\"))+(IF(LEFT(T120,1)=\"1\",((V132*AD132)*(AE132/(1-AE132))),IF(LEFT(T120,1)=\"2\",IF(COUNTA(V120:X120)=0,\"Fill in supplementary fields\",(W120+X120)*AE120*AD120))))","v":{"$error":"#VALUE!"}},{"$f":"IF(V120>W120,\"B cannot be higher than C\",IFERROR(IF(COUNTA(AA120:AB120)=0,\"Fill in supplementary fields\",IF(AA120=0,X120/2*(V120/W120)+X120/2*(1/AB120),(X120/2)*(V120/W120))),\"Fill in supplementary fields\"))+(IF(LEFT(T120,1)=\"1\",((V132*AD132)*(AE132/(1-AE132))),IF(LEFT(T120,1)=\"2\",IF(COUNTA(V120:X120)=0,\"Fill in supplementary fields\",(W120+X120)*AE120*AD120))))","v":{"$error":"#VALUE!"}},"Enter exposure values in fields A and B","Fill in supplementary fields","Fill in supplementary fields","Fill in supplementary fields","Fill in supplementary fields",0,0,0,0,0,0,0]
[null,null,null,null,null,null,null,null,null,null,null,null,null,null,null,null,null,null,"",null,null,null,null,null,null,"",null,null,null,null,null,null,null,null,null,null,null,"",117,"Fill in supplementary fields","Fill in supplementary fields",{"$f":"IF(V121>W121,\"B cannot be higher than C\",IF(COUNTA(AA121:AB121)=0,\"Fill in supplementary fields\",(X121/2)*(V121/W121)+(X121/2)*(1/SUM(AA121:AB121))))+(IF(LEFT(T121,1)=\"1\",((W121+X121)/AC121)*(V121/(W121+X121))*AD121*AE121*(AC121/(1-AE121)),IF(LEFT(T121,1)=\"2\",IF(COUNTA(V121:X121)=0,\"Fill in supplementary fields\",(W121+X121)*AE121*AD121))))","v":{"$error":"#VALUE!"}},{"$f":"IF(V121>W121,\"B cannot be higher than C\",IFERROR(IF(COUNTA(AA121:AB121)=0,\"Fill in supplementary fields\",X121/2)*(V121/W121)+(X121/2)*(1/AA121),\"Fill in supplementary fields\"))+(IF(LEFT(T121,1)=\"1\",((W121+X121)/AC121)*(V121/(W121+X121))*AD121*AE121*(AC121/(1-AE121)),IF(LEFT(T121,1)=\"2\",IF(COUNTA(V121:X121)=0,\"Fill in supplementary fields\",(W121+X121)*AE121*AD121))))","v":{"$error":"#VALUE!"}},{"$f":"IF(V121>W121,\"B cannot be higher than C\",IFERROR(IF(COUNTA(AA121:AB121)=0,\"Fill in supplementary fields\",IF(AA121=0,X121/2*(V121/W121)+X121/2*(1/AB121),(X121/2)*(V121/W121))),\"Fill in supplementary fields\"))+(IF(LEFT(T121,1)=\"1\",((W121+X121)/AC121)*(V121/(W121+X121))*AD121*AE121*(AC121/(1-AE121)),IF(LEFT(T121,1)=\"2\",IF(COUNTA(V121:X121)=0,\"Fill in supplementary fields\",(W121+X121)*AE121*AD121))))","v":{"$error":"#VALUE!"}},"Enter exposure values in fields A and B","Fill in supplementary fields","Fill in supplementary fields","Fill in supplementary fields","Fill in supplementary fields",0,0,0,0,0,0,0]
[null,null,null,null,null,null,null,null,null,null,null,null,null,null,null,null,null,null,"",null,null,null,null,null,null,"",null,null,null,null,null,null,null,null,null,null,null,"",118,"Fill in supplementary fields","Fill in supplementary fields",{"$error":"#VALUE!"},{"$error":"#VALUE!"},{"$error":"#VALUE!"},"Enter exposure values in fields A and B","Fill in supplementary fields","Fill in supplementary fields","Fill in supplementary fields","Fill in supplementary fields",0,0,0,0,0,0,0]
[null,null,null,null,null,null,null,null,null,null,null,null,null,null,null,null,null,null,"",null,null,null,null,null,null,"",null,null,null,null,null,null,null,null,null,null,null,"",119,"Fill in supplementary fields","Fill in supplementary fields",{"$f":"IF(V123>W123,\"B cannot be higher than C\",IF(COUNTA(AA123:AB123)=0,\"Fill in supplementary fields\",(X123/2)*(V123/W123)+(X123/2)*(1/SUM(AA123:AB123))))+(IF(LEFT(T123,1)=\"1\",((V135*AD135)*(AE135/(1-AE135))),IF(LEFT(T123,1)=\"2\",IF(COUNTA(V123:X123)=0,\"Fill in supplementary fields\",(W123+X123)*AE123*AD123))))","v":{"$error":"#VALUE!"}},{"$f":"IF(V123>W123,\"B cannot be higher than C\",IFERROR(IF(COUNTA(AA123:AB123)=0,\"Fill in supplementary fields\",X123/2)*(V123/W123)+(X123/2)*(1/AA123),\"Fill in supplementary fields\"))+(IF(LEFT(T123,1)=\"1\",((V135*AD135)*(AE135/(1-AE135))),IF(LEFT(T123,1)=\"2\",IF(COUNTA(V123:X123)=0,\"Fill in supplementary fields\",(W123+X123)*AE123*AD123))))","v":{"$error":"#VALUE!"}},{"$f":"IF(V123>W123,\"B cannot be higher than C\",IFERROR(IF(COUNTA(AA123:AB123)=0,\"Fill in supplementary fields\",IF(AA123=0,X123/2*(V123/W123)+X123/2*(1/AB123),(X123/2)*(V123/W123))),\"Fill in supplementary fields\"))+(IF(LEFT(T123,1)=\"1\",((V135*AD135)*(AE135/(1-AE135))),IF(LEFT(T123,1)=\"2\",IF(COUNTA(V123:X123)=0,\"Fill in supplementary fields\",(W123+X123)*AE123*AD123))))","v":{"$error":"#VALUE!"}},"Enter exposure values in fields A and B","Fill in supplementary fields","Fill in supplementary fields","Fill in supplementary fields","Fill in supplementary fields",0,0,0,0,0,0,0]
[null,null,null,null,null,null,null,null,null,null,null,null,null,null,null,null,null,null,"",null,null,null,null,null,null,"",null,null,null,null,null,null,null,null,null,null,null,"",120,"Fill in supplementary fields","Fill in supplementary fields",{"$f":"IF(V124>W124,\"B cannot be higher than C\",IF(COUNTA(AA124:AB124)=0,\"Fill in supplementary fields\",(X124/2)*(V124/W124)+(X124/2)*(1/SUM(AA124:AB124))))+(IF(LEFT(T124,1)=\"1\",((W124+X124)/AC124)*(V124/(W124+X124))*AD124*AE124*(AC124/(1-AE124)),IF(LEFT(T124,1)=\"2\",IF(COUNTA(V124:X124)=0,\"Fill in supplementary fields\",(W124+X124)*AE124*AD124))))","v":{"$error":"#VALUE!"}},{"$f":"IF(V124>W124,\"B cannot be higher than C\",IFERROR(IF(COUNTA(AA124:AB124)=0,\"Fill in supplementary fields\",X124/2)*(V124/W124)+(X124/2)*(1/AA124),\"Fill in supplementary fields\"))+(IF(LEFT(T124,1)=\"1\",((W124+X124)/AC124)*(V124/(W124+X124))*AD124*AE124*(AC124/(1-AE124)),IF(LEFT(T124,1)=\"2\",IF(COUNTA(V124:X124)=0,\"Fill in supplementary fields\",(W124+X124)*AE124*AD124))))","v":{"$error":"#VALUE!"}},{"$f":"IF(V124>W124,\"B cannot be higher than C\",IFERROR(IF(COUNTA(AA124:AB124)=0,\"Fill in supplementary fields\",IF(AA124=0,X124/2*(V124/W124)+X124/2*(1/AB124),(X124/2)*(V124/W124))),\"Fill in supplementary fields\"))+(IF(LEFT(T124,1)=\"1\",((W124+X124)/AC124)*(V124/(W124+X124))*AD124*AE124*(AC124/(1-AE124)),IF(LEFT(T124,1)=\"2\",IF(COUNTA(V124:X124)=0,\"Fill in supplementary fields\",(W124+X124)*AE124*AD124))))","v":{"$error":"#VALUE!"}},"Enter exposure values in fields A and B","Fill in supplementary fields","Fill in supplementary fields","Fill in supplementary fields","Fill in supplementary fields",0,0,0,0,0,0,0]
[null,null,null,null,null,null,null,null,null,null,null,null,null,null,null,null,null,null,"",null,null,null,null,null,null,"",null,null,null,null,null,null,null,null,null,null,null,"",121,"Fill in supplementary fields","Fill in supplementary fields",{"$error":"#VALUE!"},{"$error":"#VALUE!"},{"$error":"#VALUE!"},"Enter exposure values in fields A and B","Fill in supplementary fields","Fill in supplementary fields","Fill in supplementary fields","Fill in supplementary fields",0,0,0,0,0,0,0]
[null,null,null,null,null,null,null,null,null,null,null,null,null,null,null,null,null,null,"",null,null,null,null,null,null,"",null,null,null,null,null,null,null,null,null,null,null,"",122,"Fill in supplementary fields","Fill in supplementary fields",{"$f":"IF(V126>W126,\"B cannot be higher than C\",IF(COUNTA(AA126:AB126)=0,\"Fill in supplementary fields\",(X126/2)*(V126/W126)+(X126/2)*(1/SUM(AA126:AB126))))+(IF(LEFT(T126,1)=\"1\",((V138*AD138)*(AE138/(1-AE138))),IF(LEFT(T126,1)=\"2\",IF(COUNTA(V126:X126)=0,\"Fill in supplementary fields\",(W126+X126)*AE126*AD126))))","v":{"$error":"#VALUE!"}},{"$f":"IF(V126>W126,\"B cannot be higher than C\",IFERROR(IF(COUNTA(AA126:AB126)=0,\"Fill in supplementary fields\",X126/2)*(V126/W126)+(X126/2)*(1/AA126),\"Fill in supplementary fields\"))+(IF(LEFT(T126,1)=\"1\",((V138*AD138)*(AE138/(1-AE138))),IF(LEFT(T126,1)=\"2\",IF(COUNTA(V126:X126)=0,\"Fill in supplementary fields\",(W126+X126)*AE126*AD126))))","v":{"$error":"#VALUE!"}},{"$f":"IF(V126>W126,\"B cannot be higher than C\",IFERROR(IF(COUNTA(AA126:AB126)=0,\"Fill in supplementary fields\",IF(AA126=0,X126/2*(V126/W126)+X126/2*(1/AB126),(X126/2)*(V126/W126))),\"Fill in supplementary fields\"))+(IF(LEFT(T126,1)=\"1\",((V138*AD138)*(AE138/(1-AE138))),IF(LEFT(T126,1)=\"2\",IF(COUNTA(V126:X126)=0,\"Fill in supplementary fields\",(W126+X126)*AE126*AD126))))","v":{"$error":"#VALUE!"}},"Enter exposure values in fields A and B","Fill in supplementary fields","Fill in supplementary fields","Fill in supplementary fields","Fill in supplementary fields",0,0,0,0,0,0,0]
[null,null,null,null,null,null,null,null,null,null,null,null,null,null,null,null,null,null,"",null,null,null,null,null,null,"",null,null,null,null,null,null,null,null,null,null,null,"",123,"Fill in supplementary fields","Fill in supplementary fields",{"$f":"IF(V127>W127,\"B cannot be higher than C\",IF(COUNTA(AA127:AB127)=0,\"Fill in supplementary fields\",(X127/2)*(V127/W127)+(X127/2)*(1/SUM(AA127:AB127))))+(IF(LEFT(T127,1)=\"1\",((W127+X127)/AC127)*(V127/(W127+X127))*AD127*AE127*(AC127/(1-AE127)),IF(LEFT(T127,1)=\"2\",IF(COUNTA(V127:X127)=0,\"Fill in supplementary fields\",(W127+X127)*AE127*AD127))))","v":{"$error":"#VALUE!"}},{"$f":"IF(V127>W127,\"B cannot be higher than C\",IFERROR(IF(COUNTA(AA127:AB127)=0,\"Fill in supplementary fields\",X127/2)*(V127/W127)+(X127/2)*(1/AA127),\"Fill in supplementary fields\"))+(IF(LEFT(T127,1)=\"1\",((W127+X127)/AC127)*(V127/(W127+X127))*AD127*AE127*(AC127/(1-AE127)),IF(LEFT(T127,1)=\"2\",IF(COUNTA(V127:X127)=0,\"Fill in supplementary fields\",(W127+X127)*AE127*AD127))))","v":{"$error":"#VALUE!"}},{"$f":"IF(V127>W127,\"B cannot be higher than C\",IFERROR(IF(COUNTA(AA127:AB127)=0,\"Fill in supplementary fields\",IF(AA127=0,X127/2*(V127/W127)+X127/2*(1/AB127),(X127/2)*(V127/W127))),\"Fill in supplementary fields\"))+(IF(LEFT(T127,1)=\"1\",((W127+X127)/AC127)*(V127/(W127+X127))*AD127*AE127*(AC127/(1-AE127)),IF(LEFT(T127,1)=\"2\",IF(COUNTA(V127:X127)=0,\"Fill in supplementary fields\",(W127+X127)*AE127*AD127))))","v":{"$error":"#VALUE!"}},"Enter exposure values in fields A and B","Fill in supplementary fields","Fill in supplementary fields","Fill in supplementary fields","Fill in supplementary fields",0,0,0,0,0,0,0]
[null,null,null,null,null,null,null,null,null,null,null,null,null,null,null,null,null,null,"",null,null,null,null,null,null,"",null,null,null,null,null,null,null,null,null,null,null,"",124,"Fill in supplementary fields","Fill in supplementary fields",{"$error":"#VALUE!"},{"$error":"#VALUE!"},{"$error":"#VALUE!"},"Enter exposure values in fields A and B","Fill in supplementary fields","Fill in supplementary fields","Fill in supplementary fields","Fill in supplementary fields",0,0,0,0,0,0,0]
[null,null,null,null,null,null,null,null,null,null,null,null,null,null,null,null,null,null,"",null,null,null,null,null,null,"",null,null,null,null,null,null,null,null,null,null,null,"",125,"Fill in supplementary fields","Fill in supplementary fields",{"$f":"IF(V129>W129,\"B cannot be higher than C\",IF(COUNTA(AA129:AB129)=0,\"Fill in supplementary fields\",(X129/2)*(V129/W129)+(X129/2)*(1/SUM(AA129:AB129))))+(IF(LEFT(T129,1)=\"1\",((V141*AD141)*(AE141/(1-AE141))),IF(LEFT(T129,1)=\"2\",IF(COUNTA(V129:X129)=0,\"Fill in supplementary fields\",(W129+X129)*AE129*AD129))))","v":{"$error":"#VALUE!"}},{"$f":"IF(V129>W129,\"B cannot be higher than C\",IFERROR(IF(COUNTA(AA129:AB129)=0,\"Fill in supplementary fields\",X129/2)*(V129/W129)+(X129/2)*(1/AA129),\"Fill in supplementary fields\"))+(IF(LEFT(T129,1)=\"1\",((V141*AD141)*(AE141/(1-AE141))),IF(LEFT(T129,1)=\"2\",IF(COUNTA(V129:X129)=0,\"Fill in supplementary fields\",(W129+X129)*AE129*AD129))))","v":{"$error":"#VALUE!"}},{"$f":"IF(V129>W129,\"B cannot be higher than C\",IFERROR(IF(COUNTA(AA129:AB129)=0,\"Fill in supplementary fields\",IF(AA129=0,X129/2*(V129/W129)+X129/2*(1/AB129),(X129/2)*(V129/W129))),\"Fill in supplementary fields\"))+(IF(LEFT(T129,1)=\"1\",((V141*AD141)*(AE141/(1-AE141))),IF(LEFT(T129,1)=\"2\",IF(COUNTA(V129:X129)=0,\"Fill in supplementary fields\",(W129+X129)*AE129*AD129))))","v":{"$error":"#VALUE!"}},"Enter exposure values in fields A and B","Fill in supplementary fields","Fill in supplementary fields","Fill in supplementary fields","Fill in supplementary fields",0,0,0,0,0,0,0]
[null,null,null,null,null,null,null,null,null,null,null,null,null,null,null,null,null,null,"",null,null,null,null,null,null,"",null,null,null,null,null,null,null,null,null,null,null,"",126,"Fill in supplementary fields","Fill in supplementary fields",{"$f":"IF(V130>W130,\"B cannot be higher than C\",IF(COUNTA(AA130:AB130)=0,\"Fill in supplementary fields\",(X130/2)*(V130/W130)+(X130/2)*(1/SUM(AA130:AB130))))+(IF(LEFT(T130,1)=\"1\",((W130+X130)/AC130)*(V130/(W130+X130))*AD130*AE130*(AC130/(1-AE130)),IF(LEFT(T130,1)=\"2\",IF(COUNTA(V130:X130)=0,\"Fill in supplementary fields\",(W130+X130)*AE130*AD130))))","v":{"$error":"#VALUE!"}},{"$f":"IF(V130>W130,\"B cannot be higher than C\",IFERROR(IF(COUNTA(AA130:AB130)=0,\"Fill in supplementary fields\",X130/2)*(V130/W130)+(X130/2)*(1/AA130),\"Fill in supplementary fields\"))+(IF(LEFT(T130,1)=\"1\",((W130+X130)/AC130)*(V130/(W130+X130))*AD130*AE130*(AC130/(1-AE130)),IF(LEFT(T130,1)=\"2\",IF(COUNTA(V130:X130)=0,\"Fill in supplementary fields\",(W130+X130)*AE130*AD130))))","v":{"$error":"#VALUE!"}},{"$f":"IF(V130>W130,\"B cannot be higher than C\",IFERROR(IF(COUNTA(AA130:AB130)=0,\"Fill in supplementary fields\",IF(AA130=0,X130/2*(V130/W130)+X130/2*(1/AB130),(X130/2)*(V130/W130))),\"Fill in supplementary fields\"))+(IF(LEFT(T130,1)=\"1\",((W130+X130)/AC130)*(V130/(W130+X130))*AD130*AE130*(AC130/(1-AE130)),IF(LEFT(T130,1)=\"2\",IF(COUNTA(V130:X130)=0,\"Fill in supplementary fields\",(W130+X130)*AE130*AD130))))","v":{"$error":"#VALUE!"}},"Enter exposure values in fields A and B","Fill in supplementary fields","Fill in supplementary fields","Fill in supplementary fields","Fill in supplementary fields",0,0,0,0,0,0,0]
[null,null,null,null,null,null,null,null,null,null,null,null,null,null,null,null,null,null,"",null,null,null,null,null,null,"",null,null,null,null,null,null,null,null,null,null,null,"",127,"Fill in supplementary fields","Fill in supplementary fields",{"$error":"#VALUE!"},{"$error":"#VALUE!"},{"$error":"#VALUE!"},"Enter exposure values in fields A and B","Fill in supplementary fields","Fill in supplementary fields","Fill in supplementary fields","Fill in supplementary fields",0,0,0,0,0,0,0]
[null,null,null,null,null,null,null,null,null,null,null,null,null,null,null,null,null,null,"",null,null,null,null,null,null,"",null,null,null,null,null,null,null,null,null,null,null,"",128,"Fill in supplementary fields","Fill in supplementary fields",{"$f":"IF(V132>W132,\"B cannot be higher than C\",IF(COUNTA(AA132:AB132)=0,\"Fill in supplementary fields\",(X132/2)*(V132/W132)+(X132/2)*(1/SUM(AA132:AB132))))+(IF(LEFT(T132,1)=\"1\",((V144*AD144)*(AE144/(1-AE144))),IF(LEFT(T132,1)=\"2\",IF(COUNTA(V132:X132)=0,\"Fill in supplementary fields\",(W132+X132)*AE132*AD132))))","v":{"$error":"#VALUE!"}},{"$f":"IF(V132>W132,\"B cannot be higher than C\",IFERROR(IF(COUNTA(AA132:AB132)=0,\"Fill in supplementary fields\",X132/2)*(V132/W132)+(X132/2)*(1/AA132),\"Fill in supplementary fields\"))+(IF(LEFT(T132,1)=\"1\",((V144*AD144)*(AE144/(1-AE144))),IF(LEFT(T132,1)=\"2\",IF(COUNTA(V132:X132)=0,\"Fill in supplementary fields\",(W132+X132)*AE132*AD132))))","v":{"$error":"#VALUE!"}},{"$f":"IF(V132>W132,\"B cannot be higher than C\",IFERROR(IF(COUNTA(AA132:AB132)=0,\"Fill in supplementary fields\",IF(AA132=0,X132/2*(V132/W132)+X132/2*(1/AB132),(X132/2)*(V132/W132))),\"Fill in supplementary fields\"))+(IF(LEFT(T132,1)=\"1\",((V144*AD144)*(AE144/(1-AE144))),IF(LEFT(T132,1)=\"2\",IF(COUNTA(V132:X132)=0,\"Fill in supplementary fields\",(W132+X132)*AE132*AD132))))","v":{"$error":"#VALUE!"}},"Enter exposure values in fields A and B","Fill in supplementary fields","Fill in supplementary fields","Fill in supplementary fields","Fill in supplementary fields",0,0,0,0,0,0,0]
[null,null,null,null,null,null,null,null,null,null,null,null,null,null,null,null,null,null,"",null,null,null,null,null,null,"",null,null,null,null,null,null,null,null,null,null,null,"",129,"Fill in supplementary fields","Fill in supplementary fields",{"$f":"IF(V133>W133,\"B cannot be higher than C\",IF(COUNTA(AA133:AB133)=0,\"Fill in supplementary fields\",(X133/2)*(V133/W133)+(X133/2)*(1/SUM(AA133:AB133))))+(IF(LEFT(T133,1)=\"1\",((W133+X133)/AC133)*(V133/(W133+X133))*AD133*AE133*(AC133/(1-AE133)),IF(LEFT(T133,1)=\"2\",IF(COUNTA(V133:X133)=0,\"Fill in supplementary fields\",(W133+X133)*AE133*AD133))))","v":{"$error":"#VALUE!"}},{"$f":"IF(V133>W133,\"B cannot be higher than C\",IFERROR(IF(COUNTA(AA133:AB133)=0,\"Fill in supplementary fields\",X133/2)*(V133/W133)+(X133/2)*(1/AA133),\"Fill in supplementary fields\"))+(IF(LEFT(T133,1)=\"1\",((W133+X133)/AC133)*(V133/(W133+X133))*AD133*AE133*(AC133/(1-AE133)),IF(LEFT(T133,1)=\"2\",IF(COUNTA(V133:X133)=0,\"Fill in supplementary fields\",(W133+X133)*AE133*AD133))))","v":{"$error":"#VALUE!"}},{"$f":"IF(V133>W133,\"B cannot be higher than C\",IFERROR(IF(COUNTA(AA133:AB133)=0,\"Fill in supplementary fields\",IF(AA133=0,X133/2*(V133/W133)+X133/2*(1/AB133),(X133/2)*(V133/W133))),\"Fill in supplementary fields\"))+(IF(LEFT(T133,1)=\"1\",((W133+X133)/AC133)*(V133/(W133+X133))*AD133*AE133*(AC133/(1-AE133)),IF(LEFT(T133,1)=\"2\",IF(COUNTA(V133:X133)=0,\"Fill in supplementary fields\",(W133+X133)*AE133*AD133))))","v":{"$error":"#VALUE!"}},"Enter exposure values in fields A and B","Fill in supplementary fields","Fill in supplementary fields","Fill in supplementary fields","Fill in supplementary fields",0,0,0,0,0,0,0]
[null,null,null,null,null,null,null,null,null,null,null,null,null,null,null,null,null,null,{"$f":"IF(LEN(Q134)=0,\"\",HLOOKUP(AL134,$AN$5:$BC$200,AM134,FALSE))","v":""},null,null,null,null,null,null,{"$f":"IFERROR(IF(Q134=\"1=Syndicated loan, arranger\",\"1=Official institution\",IF(Q134=1,\"1=Official institution\",\"\")),\"\")","v":""},null,null,null,null,null,null,null,null,null,null,null,{"$f":"IFERROR(VLOOKUP(Q134,BE:BF,2,FALSE),\"\")","v":""},{"$f":"AM133+1","v":130},{"$f":"IF(V134>W134,\"B cannot be higher than C\",IF(COUNTA(V134:X134)=0,\"Fill in supplementary fields\",IFERROR(IF(VALUE(LEFT(Z134,1))=1,X134/2+(V134/W134)*(X134/2),IF(VALUE(LEFT(Z134,1))=2,\"impossible combination\",\"check not available\")),\"\")))","v":"Fill in supplementary fields"},{"$f":"IF(V134>W134,\"B cannot be higher than C\",IF(COUNTA(V134:X134)=0,\"Fill in supplementary fields\",IFERROR(IF(VALUE(LEFT(Z134,1))=1,(V134/W134)*(X134/2),IF(VALUE(LEFT(Z134,1))=2,(V134/W134)*(X134),\"check not available\")),\"\")))","v":"Fill in supplementary fields"},{"$error":"#VALUE!"},{"$error":"#VALUE!"},{"$error":"#VALUE!"},{"$f":"IF(V134>W134,\"B cannot be higher than C\",IF(COUNTA(V134:X134)=0,\"Enter exposure values in fields A and B\",(X134)*(V134/W134)))","v":"Enter exposure values in fields A and B"},{"$f":"IF(V134>W134,\"B cannot be higher than C\",IFERROR(IF(COUNTA(AA134:AB134)=0,\"Fill in supplementary fields\",X134/2)*(V134/W134)+(X134/2)*(1/AA134),\"Fill in supplementary fields\"))","v":"Fill in supplementary fields"},{"$f":"IF(V134>W134,\"B cannot be higher than C\",IFERROR(IF(COUNTA(AA134:AB134)=0,\"Fill in supplementary fields\",IF(AA134=0,X134/2*(V134/W134)+X134/2*(1/AB134),(X134/2)*(V134/W134))),\"Fill in supplementary fields\"))","v":"Fill in supplementary fields"},{"$f":"IF(V134>W134,\"B cannot be higher than C\",IF(COUNTA(V134:X134)=0,\"Fill in supplementary fields\",(V134/W134)*((X134)+AD134*AE134)))","v":"Fill in supplementary fields"},{"$f":"IF(V134>W134,\"B cannot be higher than C\",IF(COUNTA(V134:X134)=0,\"Fill in supplementary fields\",(X134)*(V134/W134)))","v":"Fill in supplementary fields"},{"$f":"$X134","v":0},0,0,0,0,0,0]
[null,null,null,null,null,null,null,null,null,null,null,null,null,null,null,null,null,null,"",null,null,null,null,null,null,"",null,null,null,null,null,null,null,null,null,null,null,"",131,"Fill in supplementary fields","Fill in supplementary fields",{"$f":"IF(V135>W135,\"B cannot be higher than C\",IF(COUNTA(AA135:AB135)=0,\"Fill in supplementary fields\",(X135/2)*(V135/W135)+(X135/2)*(1/SUM(AA135:AB135))))+(IF(LEFT(T135,1)=\"1\",((V147*AD147)*(AE147/(1-AE147))),IF(LEFT(T135,1)=\"2\",IF(COUNTA(V135:X135)=0,\"Fill in supplementary fields\",(W135+X135)*AE135*AD135))))","v":{"$error":"#VALUE!"}},{"$f":"IF(V135>W135,\"B cannot be higher than C\",IFERROR(IF(COUNTA(AA135:AB135)=0,\"Fill in supplementary fields\",X135/2)*(V135/W135)+(X135/2)*(1/AA135),\"Fill in supplementary fields\"))+(IF(LEFT(T135,1)=\"1\",((V147*AD147)*(AE147/(1-AE147))),IF(LEFT(T135,1)=\"2\",IF(COUNTA(V135:X135)=0,\"Fill in supplementary fields\",(W135+X135)*AE135*AD135))))","v":{"$error":"#VALUE!"}},{"$f":"IF(V135>W135,\"B cannot be higher than C\",IFERROR(IF(COUNTA(AA135:AB135)=0,\"Fill in supplementary fields\",IF(AA135=0,X135/2*(V135/W135)+X135/2*(1/AB135),(X135/2)*(V135/W135))),\"Fill in supplementary fields\"))+(IF(LEFT(T135,1)=\"1\",((V147*AD147)*(AE147/(1-AE147))),IF(LEFT(T135,1)=\"2\",IF(COUNTA(V135:X135)=0,\"Fill in supplementary fields\",(W135+X135)*AE135*AD135))))","v":{"$error":"#VALUE!"}},"Enter exposure values in fields A and B","Fill in supplementary fields","Fill in supplementary fields","Fill in supplementary fields","Fill in supplementary fields",0,0,0,0,0,0,0]
[null,null,null,null,null,null,null,null,null,null,null,null,null,null,null,null,null,null,"",null,null,null,null,null,null,"",null,null,null,null,null,null,null,null,null,null,null,"",132,"Fill in supplementary fields","Fill in supplementary fields",{"$f":"IF(V136>W136,\"B cannot be higher than C\",IF(COUNTA(AA136:AB136)=0,\"Fill in supplementary fields\",(X136/2)*(V136/W136)+(X136/2)*(1/SUM(AA136:AB136))))+(IF(LEFT(T136,1)=\"1\",((W136+X136)/AC136)*(V136/(W136+X136))*AD136*AE136*(AC136/(1-AE136)),IF(LEFT(T136,1)=\"2\",IF(COUNTA(V136:X136)=0,\"Fill in supplementary fields\",(W136+X136)*AE136*AD136))))","v":{"$error":"#VALUE!"}},{"$f":"IF(V136>W136,\"B cannot be higher than C\",IFERROR(IF(COUNTA(AA136:AB136)=0,\"Fill in supplementary fields\",X136/2)*(V136/W136)+(X136/2)*(1/AA136),\"Fill in supplementary fields\"))+(IF(LEFT(T136,1)=\"1\",((W136+X136)/AC136)*(V136/(W136+X136))*AD136*AE136*(AC136/(1-AE136)),IF(LEFT(T136,1)=\"2\",IF(COUNTA(V136:X136)=0,\"Fill in supplementary fields\",(W136+X136)*AE136*AD136))))","v":{"$error":"#VALUE!"}},{"$f":"IF(V136>W136,\"B cannot be higher than C\",IFERROR(IF(COUNTA(AA136:AB136)=0,\"Fill in supplementary fields\",IF(AA136=0,X136/2*(V136/W136)+X136/2*(1/AB136),(X136/2)*(V136/W136))),\"Fill in supplementary fields\"))+(IF(LEFT(T136,1)=\"1\",((W136+X136)/AC136)*(V136/(W136+X136))*AD136*AE136*(AC136/(1-AE136)),IF(LEFT(T136,1)=\"2\",IF(COUNTA(V136:X136)=0,\"Fill in supplementary fields\",(W136+X136)*AE136*AD136))))","v":{"$error":"#VALUE!"}},"Enter exposure values in fields A and B","Fill in supplementary fields","Fill in supplementary fields","Fill in supplementary fields","Fill in supplementary fields",0,0,0,0,0,0,0]
[null,null,null,null,null,null,null,null,null,null,null,null,null,null,null,null,null,null,"",null,null,null,null,null,null,"",null,null,null,null,null,null,null,null,null,null,null,"",133,"Fill in supplementary fields","Fill in supplementary fields",{"$error":"#VALUE!"},{"$error":"#VALUE!"},{"$error":"#VALUE!"},"Enter exposure values in fields A and B","Fill in supplementary fields","Fill in supplementary fields","Fill in supplementary fields","Fill in supplementary fields",0,0,0,0,0,0,0]
[null,null,null,null,null,null,null,null,null,null,null,null,null,null,null,null,null,null,"",null,null,null,null,null,null,"",null,null,null,null,null,null,null,null,null,null,null,"",134,"Fill in supplementary fields","Fill in supplementary fields",{"$f":"IF(V138>W138,\"B cannot be higher than C\",IF(COUNTA(AA138:AB138)=0,\"Fill in supplementary fields\",(X138/2)*(V138/W138)+(X138/2)*(1/SUM(AA138:AB138))))+(IF(LEFT(T138,1)=\"1\",((V150*AD150)*(AE150/(1-AE150))),IF(LEFT(T138,1)=\"2\",IF(COUNTA(V138:X138)=0,\"Fill in supplementary fields\",(W138+X138)*AE138*AD138))))","v":{"$error":"#VALUE!"}},{"$f":"IF(V138>W138,\"B cannot be higher than C\",IFERROR(IF(COUNTA(AA138:AB138)=0,\"Fill in supplementary fields\",X138/2)*(V138/W138)+(X138/2)*(1/AA138),\"Fill in supplementary fields\"))+(IF(LEFT(T138,1)=\"1\",((V150*AD150)*(AE150/(1-AE150))),IF(LEFT(T138,1)=\"2\",IF(COUNTA(V138:X138)=0,\"Fill in supplementary fields\",(W138+X138)*AE138*AD138))))","v":{"$error":"#VALUE!"}},{"$f":"IF(V138>W138,\"B cannot be higher than C\",IFERROR(IF(COUNTA(AA138:AB138)=0,\"Fill in supplementary fields\",IF(AA138=0,X138/2*(V138/W138)+X138/2*(1/AB138),(X138/2)*(V138/W138))),\"Fill in supplementary fields\"))+(IF(LEFT(T138,1)=\"1\",((V150*AD150)*(AE150/(1-AE150))),IF(LEFT(T138,1)=\"2\",IF(COUNTA(V138:X138)=0,\"Fill in supplementary fields\",(W138+X138)*AE138*AD138))))","v":{"$error":"#VALUE!"}},"Enter exposure values in fields A and B","Fill in supplementary fields","Fill in supplementary fields","Fill in supplementary fields","Fill in supplementary fields",0,0,0,0,0,0,0]
[null,null,null,null,null,null,null,null,null,null,null,null,null,null,null,null,null,null,"",null,null,null,null,null,null,"",null,null,null,null,null,null,null,null,null,null,null,"",135,"Fill in supplementary fields","Fill in supplementary fields",{"$f":"IF(V139>W139,\"B cannot be higher than C\",IF(COUNTA(AA139:AB139)=0,\"Fill in supplementary fields\",(X139/2)*(V139/W139)+(X139/2)*(1/SUM(AA139:AB139))))+(IF(LEFT(T139,1)=\"1\",((W139+X139)/AC139)*(V139/(W139+X139))*AD139*AE139*(AC139/(1-AE139)),IF(LEFT(T139,1)=\"2\",IF(COUNTA(V139:X139)=0,\"Fill in supplementary fields\",(W139+X139)*AE139*AD139))))","v":{"$error":"#VALUE!"}},{"$f":"IF(V139>W139,\"B cannot be higher than C\",IFERROR(IF(COUNTA(AA139:AB139)=0,\"Fill in supplementary fields\",X139/2)*(V139/W139)+(X139/2)*(1/AA139),\"Fill in supplementary fields\"))+(IF(LEFT(T139,1)=\"1\",((W139+X139)/AC139)*(V139/(W139+X139))*AD139*AE139*(AC139/(1-AE139)),IF(LEFT(T139,1)=\"2\",IF(COUNTA(V139:X139)=0,\"Fill in supplementary fields\",(W139+X139)*AE139*AD139))))","v":{"$error":"#VALUE!"}},{"$f":"IF(V139>W139,\"B cannot be higher than C\",IFERROR(IF(COUNTA(AA139:AB139)=0,\"Fill in supplementary fields\",IF(AA139=0,X139/2*(V139/W139)+X139/2*(1/AB139),(X139/2)*(V139/W139))),\"Fill in supplementary fields\"))+(IF(LEFT(T139,1)=\"1\",((W139+X139)/AC139)*(V139/(W139+X139))*AD139*AE139*(AC139/(1-AE139)),IF(LEFT(T139,1)=\"2\",IF(COUNTA(V139:X139)=0,\"Fill in supplementary fields\",(W139+X139)*AE139*AD139))))","v":{"$error":"#VALUE!"}},"Enter exposure values in fields A and B","Fill in supplementary fields","Fill in supplementary fields","Fill in supplementary fields","Fill in supplementary fields",0,0,0,0,0,0,0]
[null,null,null,null,null,null,null,null,null,null,null,null,null,null,null,null,null,null,"",null,null,null,null,null,null,"",null,null,null,null,null,null,null,null,null,null,null,"",136,"Fill in supplementary fields","Fill in supplementary fields",{"$error":"#VALUE!"},{"$error":"#VALUE!"},{"$error":"#VALUE!"},"Enter exposure values in fields A and B","Fill in supplementary fields","Fill in supplementary fields","Fill in supplementary fields","Fill in supplementary fields",0,0,0,0,0,0,0]
[null,null,null,null,null,null,null,null,null,null,null,null,null,null,null,null,null,null,"",null,null,null,null,null,null,"",null,null,null,null,null,null,null,null,null,null,null,"",137,"Fill in supplementary fields","Fill in supplementary fields",{"$f":"IF(V141>W141,\"B cannot be higher than C\",IF(COUNTA(AA141:AB141)=0,\"Fill in supplementary fields\",(X141/2)*(V141/W141)+(X141/2)*(1/SUM(AA141:AB141))))+(IF(LEFT(T141,1)=\"1\",((V153*AD153)*(AE153/(1-AE153))),IF(LEFT(T141,1)=\"2\",IF(COUNTA(V141:X141)=0,\"Fill in supplementary fields\",(W141+X141)*AE141*AD141))))","v":{"$error":"#VALUE!"}},{"$f":"IF(V141>W141,\"B cannot be higher than C\",IFERROR(IF(COUNTA(AA141:AB141)=0,\"Fill in supplementary fields\",X141/2)*(V141/W141)+(X141/2)*(1/AA141),\"Fill in supplementary fields\"))+(IF(LEFT(T141,1)=\"1\",((V153*AD153)*(AE153/(1-AE153))),IF(LEFT(T141,1)=\"2\",IF(COUNTA(V141:X141)=0,\"Fill in supplementary fields\",(W141+X141)*AE141*AD141))))","v":{"$error":"#VALUE!"}},{"$f":"IF(V141>W141,\"B cannot be higher than C\",IFERROR(IF(COUNTA(AA141:AB141)=0,\"Fill in supplementary fields\",IF(AA141=0,X141/2*(V141/W141)+X141/2*(1/AB141),(X141/2)*(V141/W141))),\"Fill in supplementary fields\"))+(IF(LEFT(T141,1)=\"1\",((V153*AD153)*(AE153/(1-AE153))),IF(LEFT(T141,1)=\"2\",IF(COUNTA(V141:X141)=0,\"Fill in supplementary fields\",(W141+X141)*AE141*AD141))))","v":{"$error":"#VALUE!"}},"Enter exposure values in fields A and B","Fill in supplementary fields","Fill in supplementary fields","Fill in supplementary fields","Fill in supplementary fields",0,0,0,0,0,0,0]
[null,null,null,null,null,null,null,null,null,null,null,null,null,null,null,null,null,null,"",null,null,null,null,null,null,"",null,null,null,null,null,null,null,null,null,null,null,"",138,"Fill in supplementary fields","Fill in supplementary fields",{"$f":"IF(V142>W142,\"B cannot be higher than C\",IF(COUNTA(AA142:AB142)=0,\"Fill in supplementary fields\",(X142/2)*(V142/W142)+(X142/2)*(1/SUM(AA142:AB142))))+(IF(LEFT(T142,1)=\"1\",((W142+X142)/AC142)*(V142/(W142+X142))*AD142*AE142*(AC142/(1-AE142)),IF(LEFT(T142,1)=\"2\",IF(COUNTA(V142:X142)=0,\"Fill in supplementary fields\",(W142+X142)*AE142*AD142))))","v":{"$error":"#VALUE!"}},{"$f":"IF(V142>W142,\"B cannot be higher than C\",IFERROR(IF(COUNTA(AA142:AB142)=0,\"Fill in supplementary fields\",X142/2)*(V142/W142)+(X142/2)*(1/AA142),\"Fill in supplementary fields\"))+(IF(LEFT(T142,1)=\"1\",((W142+X142)/AC142)*(V142/(W142+X142))*AD142*AE142*(AC142/(1-AE142)),IF(LEFT(T142,1)=\"2\",IF(COUNTA(V142:X142)=0,\"Fill in supplementary fields\",(W142+X142)*AE142*AD142))))","v":{"$error":"#VALUE!"}},{"$f":"IF(V142>W142,\"B cannot be higher than C\",IFERROR(IF(COUNTA(AA142:AB142)=0,\"Fill in supplementary fields\",IF(AA142=0,X142/2*(V142/W142)+X142/2*(1/AB142),(X142/2)*(V142/W142))),\"Fill in supplementary fields\"))+(IF(LEFT(T142,1)=\"1\",((W142+X142)/AC142)*(V142/(W142+X142))*AD142*AE142*(AC142/(1-AE142)),IF(LEFT(T142,1)=\"2\",IF(COUNTA(V142:X142)=0,\"Fill in supplementary fields\",(W142+X142)*AE142*AD142))))","v":{"$error":"#VALUE!"}},"Enter exposure values in fields A and B","Fill in supplementary fields","Fill in supplementary fields","Fill in supplementary fields","Fill in supplementary fields",0,0,0,0,0,0,0]
[null,null,null,null,null,null,null,null,null,null,null,null,null,null,null,null,null,null,"",null,null,null,null,null,null,"",null,null,null,null,null,null,null,null,null,null,null,"",139,"Fill in supplementary fields","Fill in supplementary fields",{"$error":"#VALUE!"},{"$error":"#VALUE!"},{"$error":"#VALUE!"},"Enter exposure values in fields A and B","Fill in supplementary fields","Fill in supplementary fields","Fill in supplementary fields","Fill in supplementary fields",0,0,0,0,0,0,0]
[null,null,null,null,null,null,null,null,null,null,null,null,null,null,null,null,null,null,"",null,null,null,null,null,null,"",null,null,null,null,null,null,null,null,null,null,null,"",140,"Fill in supplementary fields","Fill in supplementary fields",{"$f":"IF(V144>W144,\"B cannot be higher than C\",IF(COUNTA(AA144:AB144)=0,\"Fill in supplementary fields\",(X144/2)*(V144/W144)+(X144/2)*(1/SUM(AA144:AB144))))+(IF(LEFT(T144,1)=\"1\",((V156*AD156)*(AE156/(1-AE156))),IF(LEFT(T144,1)=\"2\",IF(COUNTA(V144:X144)=0,\"Fill in supplementary fields\",(W144+X144)*AE144*AD144))))","v":{"$error":"#VALUE!"}},{"$f":"IF(V144>W144,\"B cannot be higher than C\",IFERROR(IF(COUNTA(AA144:AB144)=0,\"Fill in supplementary fields\",X144/2)*(V144/W144)+(X144/2)*(1/AA144),\"Fill in supplementary fields\"))+(IF(LEFT(T144,1)=\"1\",((V156*AD156)*(AE156/(1-AE156))),IF(LEFT(T144,1)=\"2\",IF(COUNTA(V144:X144)=0,\"Fill in supplementary fields\",(W144+X144)*AE144*AD144))))","v":{"$error":"#VALUE!"}},{"$f":"IF(V144>W144,\"B cannot be higher than C\",IFERROR(IF(COUNTA(AA144:AB144)=0,\"Fill in supplementary fields\",IF(AA144=0,X144/2*(V144/W144)+X144/2*(1/AB144),(X144/2)*(V144/W144))),\"Fill in supplementary fields\"))+(IF(LEFT(T144,1)=\"1\",((V156*AD156)*(AE156/(1-AE156))),IF(LEFT(T144,1)=\"2\",IF(COUNTA(V144:X144)=0,\"Fill in supplementary fields\",(W144+X144)*AE144*AD144))))","v":{"$error":"#VALUE!"}},"Enter exposure values in fields A and B","Fill in supplementary fields","Fill in supplementary fields","Fill in supplementary fields","Fill in supplementary fields",0,0,0,0,0,0,0]
[null,null,null,null,null,null,null,null,null,null,null,null,null,null,null,null,null,null,"",null,null,null,null,null,null,"",null,null,null,null,null,null,null,null,null,null,null,"",141,"Fill in supplementary fields","Fill in supplementary fields",{"$f":"IF(V145>W145,\"B cannot be higher than C\",IF(COUNTA(AA145:AB145)=0,\"Fill in supplementary fields\",(X145/2)*(V145/W145)+(X145/2)*(1/SUM(AA145:AB145))))+(IF(LEFT(T145,1)=\"1\",((W145+X145)/AC145)*(V145/(W145+X145))*AD145*AE145*(AC145/(1-AE145)),IF(LEFT(T145,1)=\"2\",IF(COUNTA(V145:X145)=0,\"Fill in supplementary fields\",(W145+X145)*AE145*AD145))))","v":{"$error":"#VALUE!"}},{"$f":"IF(V145>W145,\"B cannot be higher than C\",IFERROR(IF(COUNTA(AA145:AB145)=0,\"Fill in supplementary fields\",X145/2)*(V145/W145)+(X145/2)*(1/AA145),\"Fill in supplementary fields\"))+(IF(LEFT(T145,1)=\"1\",((W145+X145)/AC145)*(V145/(W145+X145))*AD145*AE145*(AC145/(1-AE145)),IF(LEFT(T145,1)=\"2\",IF(COUNTA(V145:X145)=0,\"Fill in supplementary fields\",(W145+X145)*AE145*AD145))))","v":{"$error":"#VALUE!"}},{"$f":"IF(V145>W145,\"B cannot be higher than C\",IFERROR(IF(COUNTA(AA145:AB145)=0,\"Fill in supplementary fields\",IF(AA145=0,X145/2*(V145/W145)+X145/2*(1/AB145),(X145/2)*(V145/W145))),\"Fill in supplementary fields\"))+(IF(LEFT(T145,1)=\"1\",((W145+X145)/AC145)*(V145/(W145+X145))*AD145*AE145*(AC145/(1-AE145)),IF(LEFT(T145,1)=\"2\",IF(COUNTA(V145:X145)=0,\"Fill in supplementary fields\",(W145+X145)*AE145*AD145))))","v":{"$error":"#VALUE!"}},"Enter exposure values in fields A and B","Fill in supplementary fields","Fill in supplementary fields","Fill in supplementary fields","Fill in supplementary fields",0,0,0,0,0,0,0]
[null,null,null,null,null,null,null,null,null,null,null,null,null,null,null,null,null,null,"",null,null,null,null,null,null,"",null,null,null,null,null,null,null,null,null,null,null,"",142,"Fill in supplementary fields","Fill in supplementary fields",{"$error":"#VALUE!"},{"$error":"#VALUE!"},{"$error":"#VALUE!"},"Enter exposure values in fields A and B","Fill in supplementary fields","Fill in supplementary fields","Fill in supplementary fields","Fill in supplementary fields",0,0,0,0,0,0,0]
[null,null,null,null,null,null,null,null,null,null,null,null,null,null,null,null,null,null,"",null,null,null,null,null,null,"",null,null,null,null,null,null,null,null,null,null,null,"",143,"Fill in supplementary fields","Fill in supplementary fields",{"$f":"IF(V147>W147,\"B cannot be higher than C\",IF(COUNTA(AA147:AB147)=0,\"Fill in supplementary fields\",(X147/2)*(V147/W147)+(X147/2)*(1/SUM(AA147:AB147))))+(IF(LEFT(T147,1)=\"1\",((V159*AD159)*(AE159/(1-AE159))),IF(LEFT(T147,1)=\"2\",IF(COUNTA(V147:X147)=0,\"Fill in supplementary fields\",(W147+X147)*AE147*AD147))))","v":{"$error":"#VALUE!"}},{"$f":"IF(V147>W147,\"B cannot be higher than C\",IFERROR(IF(COUNTA(AA147:AB147)=0,\"Fill in supplementary fields\",X147/2)*(V147/W147)+(X147/2)*(1/AA147),\"Fill in supplementary fields\"))+(IF(LEFT(T147,1)=\"1\",((V159*AD159)*(AE159/(1-AE159))),IF(LEFT(T147,1)=\"2\",IF(COUNTA(V147:X147)=0,\"Fill in supplementary fields\",(W147+X147)*AE147*AD147))))","v":{"$error":"#VALUE!"}},{"$f":"IF(V147>W147,\"B cannot be higher than C\",IFERROR(IF(COUNTA(AA147:AB147)=0,\"Fill in supplementary fields\",IF(AA147=0,X147/2*(V147/W147)+X147/2*(1/AB147),(X147/2)*(V147/W147))),\"Fill in supplementary fields\"))+(IF(LEFT(T147,1)=\"1\",((V159*AD159)*(AE159/(1-AE159))),IF(LEFT(T147,1)=\"2\",IF(COUNTA(V147:X147)=0,\"Fill in supplementary fields\",(W147+X147)*AE147*AD147))))","v":{"$error":"#VALUE!"}},"Enter exposure values in fields A and B","Fill in supplementary fields","Fill in supplementary fields","Fill in supplementary fields","Fill in supplementary fields",0,0,0,0,0,0,0]
[null,null,null,null,null,null,null,null,null,null,null,null,null,null,null,null,null,null,"",null,null,null,null,null,null,"",null,null,null,null,null,null,null,null,null,null,null,"",144,"Fill in supplementary fields","Fill in supplementary fields",{"$f":"IF(V148>W148,\"B cannot be higher than C\",IF(COUNTA(AA148:AB148)=0,\"Fill in supplementary fields\",(X148/2)*(V148/W148)+(X148/2)*(1/SUM(AA148:AB148))))+(IF(LEFT(T148,1)=\"1\",((W148+X148)/AC148)*(V148/(W148+X148))*AD148*AE148*(AC148/(1-AE148)),IF(LEFT(T148,1)=\"2\",IF(COUNTA(V148:X148)=0,\"Fill in supplementary fields\",(W148+X148)*AE148*AD148))))","v":{"$error":"#VALUE!"}},{"$f":"IF(V148>W148,\"B cannot be higher than C\",IFERROR(IF(COUNTA(AA148:AB148)=0,\"Fill in supplementary fields\",X148/2)*(V148/W148)+(X148/2)*(1/AA148),\"Fill in supplementary fields\"))+(IF(LEFT(T148,1)=\"1\",((W148+X148)/AC148)*(V148/(W148+X148))*AD148*AE148*(AC148/(1-AE148)),IF(LEFT(T148,1)=\"2\",IF(COUNTA(V148:X148)=0,\"Fill in supplementary fields\",(W148+X148)*AE148*AD148))))","v":{"$error":"#VALUE!"}},{"$f":"IF(V148>W148,\"B cannot be higher than C\",IFERROR(IF(COUNTA(AA148:AB148)=0,\"Fill in supplementary fields\",IF(AA148=0,X148/2*(V148/W148)+X148/2*(1/AB148),(X148/2)*(V148/W148))),\"Fill in supplementary fields\"))+(IF(LEFT(T148,1)=\"1\",((W148+X148)/AC148)*(V148/(W148+X148))*AD148*AE148*(AC148/(1-AE148)),IF(LEFT(T148,1)=\"2\",IF(COUNTA(V148:X148)=0,\"Fill in supplementary fields\",(W148+X148)*AE148*AD148))))","v":{"$error":"#VALUE!"}},"Enter exposure values in fields A and B","Fill in supplementary fields","Fill in supplementary fields","Fill in supplementary fields","Fill in supplementary fields",0,0,0,0,0,0,0]
[null,null,null,null,null,null,null,null,null,null,null,null,null,null,null,null,null,null,"",null,null,null,null,null,null,"",null,null,null,null,null,null,null,null,null,null,null,"",145,"Fill in supplementary fields","Fill in supplementary fields",{"$error":"#VALUE!"},{"$error":"#VALUE!"},{"$error":"#VALUE!"},"Enter exposure values in fields A and B","Fill in supplementary fields","Fill in supplementary fields","Fill in supplementary fields","Fill in supplementary fields",0,0,0,0,0,0,0]
[null,null,null,null,null,null,null,null,null,null,null,null,null,null,null,null,null,null,"",null,null,null,null,null,null,"",null,null,null,null,null,null,null,null,null,null,null,"",146,"Fill in supplementary fields","Fill in supplementary fields",{"$f":"IF(V150>W150,\"B cannot be higher than C\",IF(COUNTA(AA150:AB150)=0,\"Fill in supplementary fields\",(X150/2)*(V150/W150)+(X150/2)*(1/SUM(AA150:AB150))))+(IF(LEFT(T150,1)=\"1\",((V162*AD162)*(AE162/(1-AE162))),IF(LEFT(T150,1)=\"2\",IF(COUNTA(V150:X150)=0,\"Fill in supplementary fields\",(W150+X150)*AE150*AD150))))","v":{"$error":"#VALUE!"}},{"$f":"IF(V150>W150,\"B cannot be higher than C\",IFERROR(IF(COUNTA(AA150:AB150)=0,\"Fill in supplementary fields\",X150/2)*(V150/W150)+(X150/2)*(1/AA150),\"Fill in supplementary fields\"))+(IF(LEFT(T150,1)=\"1\",((V162*AD162)*(AE162/(1-AE162))),IF(LEFT(T150,1)=\"2\",IF(COUNTA(V150:X150)=0,\"Fill in supplementary fields\",(W150+X150)*AE150*AD150))))","v":{"$error":"#VALUE!"}},{"$f":"IF(V150>W150,\"B cannot be higher than C\",IFERROR(IF(COUNTA(AA150:AB150)=0,\"Fill in supplementary fields\",IF(AA150=0,X150/2*(V150/W150)+X150/2*(1/AB150),(X150/2)*(V150/W150))),\"Fill in supplementary fields\"))+(IF(LEFT(T150,1)=\"1\",((V162*AD162)*(AE162/(1-AE162))),IF(LEFT(T150,1)=\"2\",IF(COUNTA(V150:X150)=0,\"Fill in supplementary fields\",(W150+X150)*AE150*AD150))))","v":{"$error":"#VALUE!"}},"Enter exposure values in fields A and B","Fill in supplementary fields","Fill in supplementary fields","Fill in supplementary fields","Fill in supplementary fields",{"$f":"$X150","v":0},0,0,0,0,0,0]
[null,null,null,null,null,null,null,null,null,null,null,null,null,null,null,null,null,null,"",null,null,null,null,null,null,"",null,null,null,null,null,null,null,null,null,null,null,"",147,"Fill in supplementary fields","Fill in supplementary fields",{"$f":"IF(V151>W151,\"B cannot be higher than C\",IF(COUNTA(AA151:AB151)=0,\"Fill in supplementary fields\",(X151/2)*(V151/W151)+(X151/2)*(1/SUM(AA151:AB151))))+(IF(LEFT(T151,1)=\"1\",((W151+X151)/AC151)*(V151/(W151+X151))*AD151*AE151*(AC151/(1-AE151)),IF(LEFT(T151,1)=\"2\",IF(COUNTA(V151:X151)=0,\"Fill in supplementary fields\",(W151+X151)*AE151*AD151))))","v":{"$error":"#VALUE!"}},{"$f":"IF(V151>W151,\"B cannot be higher than C\",IFERROR(IF(COUNTA(AA151:AB151)=0,\"Fill in supplementary fields\",X151/2)*(V151/W151)+(X151/2)*(1/AA151),\"Fill in supplementary fields\"))+(IF(LEFT(T151,1)=\"1\",((W151+X151)/AC151)*(V151/(W151+X151))*AD151*AE151*(AC151/(1-AE151)),IF(LEFT(T151,1)=\"2\",IF(COUNTA(V151:X151)=0,\"Fill in supplementary fields\",(W151+X151)*AE151*AD151))))","v":{"$error":"#VALUE!"}},{"$f":"IF(V151>W151,\"B cannot be higher than C\",IFERROR(IF(COUNTA(AA151:AB151)=0,\"Fill in supplementary fields\",IF(AA151=0,X151/2*(V151/W151)+X151/2*(1/AB151),(X151/2)*(V151/W151))),\"Fill in supplementary fields\"))+(IF(LEFT(T151,1)=\"1\",((W151+X151)/AC151)*(V151/(W151+X151))*AD151*AE151*(AC151/(1-AE151)),IF(LEFT(T151,1)=\"2\",IF(COUNTA(V151:X151)=0,\"Fill in supplementary fields\",(W151+X151)*AE151*AD151))))","v":{"$error":"#VALUE!"}},"Enter exposure values in fields A and B","Fill in supplementary fields","Fill in supplementary fields","Fill in supplementary fields","Fill in supplementary fields",0,0,0,0,0,0,0]
[null,null,null,null,null,null,null,null,null,null,null,null,null,null,null,null,null,null,"",null,null,null,null,null,null,"",null,null,null,null,null,null,null,null,null,null,null,"",148,"Fill in supplementary fields","Fill in supplementary fields",{"$error":"#VALUE!"},{"$error":"#VALUE!"},{"$error":"#VALUE!"},"Enter exposure values in fields A and B","Fill in supplementary fields","Fill in supplementary fields","Fill in supplementary fields","Fill in supplementary fields",0,0,0,0,0,0,0]
[null,null,null,null,null,null,null,null,null,null,null,null,null,null,null,null,null,null,"",null,null,null,null,null,null,"",null,null,null,null,null,null,null,null,null,null,null,"",149,"Fill in supplementary fields","Fill in supplementary fields",{"$f":"IF(V153>W153,\"B cannot be higher than C\",IF(COUNTA(AA153:AB153)=0,\"Fill in supplementary fields\",(X153/2)*(V153/W153)+(X153/2)*(1/SUM(AA153:AB153))))+(IF(LEFT(T153,1)=\"1\",((V165*AD165)*(AE165/(1-AE165))),IF(LEFT(T153,1)=\"2\",IF(COUNTA(V153:X153)=0,\"Fill in supplementary fields\",(W153+X153)*AE153*AD153))))","v":{"$error":"#VALUE!"}},{"$f":"IF(V153>W153,\"B cannot be higher than C\",IFERROR(IF(COUNTA(AA153:AB153)=0,\"Fill in supplementary fields\",X153/2)*(V153/W153)+(X153/2)*(1/AA153),\"Fill in supplementary fields\"))+(IF(LEFT(T153,1)=\"1\",((V165*AD165)*(AE165/(1-AE165))),IF(LEFT(T153,1)=\"2\",IF(COUNTA(V153:X153)=0,\"Fill in supplementary fields\",(W153+X153)*AE153*AD153))))","v":{"$error":"#VALUE!"}},{"$f":"IF(V153>W153,\"B cannot be higher than C\",IFERROR(IF(COUNTA(AA153:AB153)=0,\"Fill in supplementary fields\",IF(AA153=0,X153/2*(V153/W153)+X153/2*(1/AB153),(X153/2)*(V153/W153))),\"Fill in supplementary fields\"))+(IF(LEFT(T153,1)=\"1\",((V165*AD165)*(AE165/(1-AE165))),IF(LEFT(T153,1)=\"2\",IF(COUNTA(V153:X153)=0,\"Fill in supplementary fields\",(W153+X153)*AE153*AD153))))","v":{"$error":"#VALUE!"}},"Enter exposure values in fields A and B","Fill in supplementary fields","Fill in supplementary fields","Fill in supplementary fields","Fill in supplementary fields",0,0,0,0,0,0,0]
[null,null,null,null,null,null,null,null,null,null,null,null,null,null,null,null,null,null,"",null,null,null,null,null,null,"",null,null,null,null,null,null,null,null,null,null,null,"",150,"Fill in supplementary fields","Fill in supplementary fields",{"$f":"IF(V154>W154,\"B cannot be higher than C\",IF(COUNTA(AA154:AB154)=0,\"Fill in supplementary fields\",(X154/2)*(V154/W154)+(X154/2)*(1/SUM(AA154:AB154))))+(IF(LEFT(T154,1)=\"1\",((W154+X154)/AC154)*(V154/(W154+X154))*AD154*AE154*(AC154/(1-AE154)),IF(LEFT(T154,1)=\"2\",IF(COUNTA(V154:X154)=0,\"Fill in supplementary fields\",(W154+X154)*AE154*AD154))))","v":{"$error":"#VALUE!"}},{"$f":"IF(V154>W154,\"B cannot be higher than C\",IFERROR(IF(COUNTA(AA154:AB154)=0,\"Fill in supplementary fields\",X154/2)*(V154/W154)+(X154/2)*(1/AA154),\"Fill in supplementary fields\"))+(IF(LEFT(T154,1)=\"1\",((W154+X154)/AC154)*(V154/(W154+X154))*AD154*AE154*(AC154/(1-AE154)),IF(LEFT(T154,1)=\"2\",IF(COUNTA(V154:X154)=0,\"Fill in supplementary fields\",(W154+X154)*AE154*AD154))))","v":{"$error":"#VALUE!"}},{"$f":"IF(V154>W154,\"B cannot be higher than C\",IFERROR(IF(COUNTA(AA154:AB154)=0,\"Fill in supplementary fields\",IF(AA154=0,X154/2*(V154/W154)+X154/2*(1/AB154),(X154/2)*(V154/W154))),\"Fill in supplementary fields\"))+(IF(LEFT(T154,1)=\"1\",((W154+X154)/AC154)*(V154/(W154+X154))*AD154*AE154*(AC154/(1-AE154)),IF(LEFT(T154,1)=\"2\",IF(COUNTA(V154:X154)=0,\"Fill in supplementary fields\",(W154+X154)*AE154*AD154))))","v":{"$error":"#VALUE!"}},"Enter exposure values in fields A and B","Fill in supplementary fields","Fill in supplementary fields","Fill in supplementary fields","Fill in supplementary fields",0,0,0,0,0,0,0]
[null,null,null,null,null,null,null,null,null,null,null,null,null,null,null,null,null,null,"",null,null,null,null,null,null,"",null,null,null,null,null,null,null,null,null,null,null,"",151,"Fill in supplementary fields","Fill in supplementary fields",{"$error":"#VALUE!"},{"$error":"#VALUE!"},{"$error":"#VALUE!"},"Enter exposure values in fields A and B","Fill in supplementary fields","Fill in supplementary fields","Fill in supplementary fields","Fill in supplementary fields",0,0,0,0,0,0,0]
[null,null,null,null,null,null,null,null,null,null,null,null,null,null,null,null,null,null,"",null,null,null,null,null,null,"",null,null,null,null,null,null,null,null,null,null,null,"",152,"Fill in supplementary fields","Fill in supplementary fields",{"$f":"IF(V156>W156,\"B cannot be higher than C\",IF(COUNTA(AA156:AB156)=0,\"Fill in supplementary fields\",(X156/2)*(V156/W156)+(X156/2)*(1/SUM(AA156:AB156))))+(IF(LEFT(T156,1)=\"1\",((V168*AD168)*(AE168/(1-AE168))),IF(LEFT(T156,1)=\"2\",IF(COUNTA(V156:X156)=0,\"Fill in supplementary fields\",(W156+X156)*AE156*AD156))))","v":{"$error":"#VALUE!"}},{"$f":"IF(V156>W156,\"B cannot be higher than C\",IFERROR(IF(COUNTA(AA156:AB156)=0,\"Fill in supplementary fields\",X156/2)*(V156/W156)+(X156/2)*(1/AA156),\"Fill in supplementary fields\"))+(IF(LEFT(T156,1)=\"1\",((V168*AD168)*(AE168/(1-AE168))),IF(LEFT(T156,1)=\"2\",IF(COUNTA(V156:X156)=0,\"Fill in supplementary fields\",(W156+X156)*AE156*AD156))))","v":{"$error":"#VALUE!"}},{"$f":"IF(V156>W156,\"B cannot be higher than C\",IFERROR(IF(COUNTA(AA156:AB156)=0,\"Fill in supplementary fields\",IF(AA156=0,X156/2*(V156/W156)+X156/2*(1/AB156),(X156/2)*(V156/W156))),\"Fill in supplementary fields\"))+(IF(LEFT(T156,1)=\"1\",((V168*AD168)*(AE168/(1-AE168))),IF(LEFT(T156,1)=\"2\",IF(COUNTA(V156:X156)=0,\"Fill in supplementary fields\",(W156+X156)*AE156*AD156))))","v":{"$error":"#VALUE!"}},"Enter exposure values in fields A and B","Fill in supplementary fields","Fill in supplementary fields","Fill in supplementary fields","Fill in supplementary fields",0,0,0,0,0,0,0]
[null,null,null,null,null,null,null,null,null,null,null,null,null,null,null,null,null,null,"",null,null,null,null,null,null,"",null,null,null,null,null,null,null,null,null,null,null,"",153,"Fill in supplementary fields","Fill in supplementary fields",{"$f":"IF(V157>W157,\"B cannot be higher than C\",IF(COUNTA(AA157:AB157)=0,\"Fill in supplementary fields\",(X157/2)*(V157/W157)+(X157/2)*(1/SUM(AA157:AB157))))+(IF(LEFT(T157,1)=\"1\",((W157+X157)/AC157)*(V157/(W157+X157))*AD157*AE157*(AC157/(1-AE157)),IF(LEFT(T157,1)=\"2\",IF(COUNTA(V157:X157)=0,\"Fill in supplementary fields\",(W157+X157)*AE157*AD157))))","v":{"$error":"#VALUE!"}},{"$f":"IF(V157>W157,\"B cannot be higher than C\",IFERROR(IF(COUNTA(AA157:AB157)=0,\"Fill in supplementary fields\",X157/2)*(V157/W157)+(X157/2)*(1/AA157),\"Fill in supplementary fields\"))+(IF(LEFT(T157,1)=\"1\",((W157+X157)/AC157)*(V157/(W157+X157))*AD157*AE157*(AC157/(1-AE157)),IF(LEFT(T157,1)=\"2\",IF(COUNTA(V157:X157)=0,\"Fill in supplementary fields\",(W157+X157)*AE157*AD157))))","v":{"$error":"#VALUE!"}},{"$f":"IF(V157>W157,\"B cannot be higher than C\",IFERROR(IF(COUNTA(AA157:AB157)=0,\"Fill in supplementary fields\",IF(AA157=0,X157/2*(V157/W157)+X157/2*(1/AB157),(X157/2)*(V157/W157))),\"Fill in supplementary fields\"))+(IF(LEFT(T157,1)=\"1\",((W157+X157)/AC157)*(V157/(W157+X157))*AD157*AE157*(AC157/(1-AE157)),IF(LEFT(T157,1)=\"2\",IF(COUNTA(V157:X157)=0,\"Fill in supplementary fields\",(W157+X157)*AE157*AD157))))","v":{"$error":"#VALUE!"}},"Enter exposure values in fields A and B","Fill in supplementary fields","Fill in supplementary fields","Fill in supplementary fields","Fill in supplementary fields",0,0,0,0,0,0,0]
[null,null,null,null,null,null,null,null,null,null,null,null,null,null,null,null,null,null,"",null,null,null,null,null,null,"",null,null,null,null,null,null,null,null,null,null,null,"",154,"Fill in supplementary fields","Fill in supplementary fields",{"$error":"#VALUE!"},{"$error":"#VALUE!"},{"$error":"#VALUE!"},"Enter exposure values in fields A and B","Fill in supplementary fields","Fill in supplementary fields","Fill in supplementary fields","Fill in supplementary fields",0,0,0,0,0,0,0]
[null,null,null,null,null,null,null,null,null,null,null,null,null,null,null,null,null,null,"",null,null,null,null,null,null,"",null,null,null,null,null,null,null,null,null,null,null,"",155,"Fill in supplementary fields","Fill in supplementary fields",{"$f":"IF(V159>W159,\"B cannot be higher than C\",IF(COUNTA(AA159:AB159)=0,\"Fill in supplementary fields\",(X159/2)*(V159/W159)+(X159/2)*(1/SUM(AA159:AB159))))+(IF(LEFT(T159,1)=\"1\",((V171*AD171)*(AE171/(1-AE171))),IF(LEFT(T159,1)=\"2\",IF(COUNTA(V159:X159)=0,\"Fill in supplementary fields\",(W159+X159)*AE159*AD159))))","v":{"$error":"#VALUE!"}},{"$f":"IF(V159>W159,\"B cannot be higher than C\",IFERROR(IF(COUNTA(AA159:AB159)=0,\"Fill in supplementary fields\",X159/2)*(V159/W159)+(X159/2)*(1/AA159),\"Fill in supplementary fields\"))+(IF(LEFT(T159,1)=\"1\",((V171*AD171)*(AE171/(1-AE171))),IF(LEFT(T159,1)=\"2\",IF(COUNTA(V159:X159)=0,\"Fill in supplementary fields\",(W159+X159)*AE159*AD159))))","v":{"$error":"#VALUE!"}},{"$f":"IF(V159>W159,\"B cannot be higher than C\",IFERROR(IF(COUNTA(AA159:AB159)=0,\"Fill in supplementary fields\",IF(AA159=0,X159/2*(V159/W159)+X159/2*(1/AB159),(X159/2)*(V159/W159))),\"Fill in supplementary fields\"))+(IF(LEFT(T159,1)=\"1\",((V171*AD171)*(AE171/(1-AE171))),IF(LEFT(T159,1)=\"2\",IF(COUNTA(V159:X159)=0,\"Fill in supplementary fields\",(W159+X159)*AE159*AD159))))","v":{"$error":"#VALUE!"}},"Enter exposure values in fields A and B","Fill in supplementary fields","Fill in supplementary fields","Fill in supplementary fields","Fill in supplementary fields",0,0,0,0,0,0,0]
[null,null,null,null,null,null,null,null,null,null,null,null,null,null,null,null,null,null,"",null,null,null,null,null,null,"",null,null,null,null,null,null,null,null,null,null,null,"",156,"Fill in supplementary fields","Fill in supplementary fields",{"$f":"IF(V160>W160,\"B cannot be higher than C\",IF(COUNTA(AA160:AB160)=0,\"Fill in supplementary fields\",(X160/2)*(V160/W160)+(X160/2)*(1/SUM(AA160:AB160))))+(IF(LEFT(T160,1)=\"1\",((W160+X160)/AC160)*(V160/(W160+X160))*AD160*AE160*(AC160/(1-AE160)),IF(LEFT(T160,1)=\"2\",IF(COUNTA(V160:X160)=0,\"Fill in supplementary fields\",(W160+X160)*AE160*AD160))))","v":{"$error":"#VALUE!"}},{"$f":"IF(V160>W160,\"B cannot be higher than C\",IFERROR(IF(COUNTA(AA160:AB160)=0,\"Fill in supplementary fields\",X160/2)*(V160/W160)+(X160/2)*(1/AA160),\"Fill in supplementary fields\"))+(IF(LEFT(T160,1)=\"1\",((W160+X160)/AC160)*(V160/(W160+X160))*AD160*AE160*(AC160/(1-AE160)),IF(LEFT(T160,1)=\"2\",IF(COUNTA(V160:X160)=0,\"Fill in supplementary fields\",(W160+X160)*AE160*AD160))))","v":{"$error":"#VALUE!"}},{"$f":"IF(V160>W160,\"B cannot be higher than C\",IFERROR(IF(COUNTA(AA160:AB160)=0,\"Fill in supplementary fields\",IF(AA160=0,X160/2*(V160/W160)+X160/2*(1/AB160),(X160/2)*(V160/W160))),\"Fill in supplementary fields\"))+(IF(LEFT(T160,1)=\"1\",((W160+X160)/AC160)*(V160/(W160+X160))*AD160*AE160*(AC160/(1-AE160)),IF(LEFT(T160,1)=\"2\",IF(COUNTA(V160:X160)=0,\"Fill in supplementary fields\",(W160+X160)*AE160*AD160))))","v":{"$error":"#VALUE!"}},"Enter exposure values in fields A and B","Fill in supplementary fields","Fill in supplementary fields","Fill in supplementary fields","Fill in supplementary fields",0,0,0,0,0,0,0]
[null,null,null,null,null,null,null,null,null,null,null,null,null,null,null,null,null,null,"",null,null,null,null,null,null,"",null,null,null,null,null,null,null,null,null,null,null,"",157,"Fill in supplementary fields","Fill in supplementary fields",{"$error":"#VALUE!"},{"$error":"#VALUE!"},{"$error":"#VALUE!"},"Enter exposure values in fields A and B","Fill in supplementary fields","Fill in supplementary fields","Fill in supplementary fields","Fill in supplementary fields",0,0,0,0,0,0,0]
[null,null,null,null,null,null,null,null,null,null,null,null,null,null,null,null,null,null,"",null,null,null,null,null,null,"",null,null,null,null,null,null,null,null,null,null,null,"",158,"Fill in supplementary fields","Fill in supplementary fields",{"$f":"IF(V162>W162,\"B cannot be higher than C\",IF(COUNTA(AA162:AB162)=0,\"Fill in supplementary fields\",(X162/2)*(V162/W162)+(X162/2)*(1/SUM(AA162:AB162))))+(IF(LEFT(T162,1)=\"1\",((V174*AD174)*(AE174/(1-AE174))),IF(LEFT(T162,1)=\"2\",IF(COUNTA(V162:X162)=0,\"Fill in supplementary fields\",(W162+X162)*AE162*AD162))))","v":{"$error":"#VALUE!"}},{"$f":"IF(V162>W162,\"B cannot be higher than C\",IFERROR(IF(COUNTA(AA162:AB162)=0,\"Fill in supplementary fields\",X162/2)*(V162/W162)+(X162/2)*(1/AA162),\"Fill in supplementary fields\"))+(IF(LEFT(T162,1)=\"1\",((V174*AD174)*(AE174/(1-AE174))),IF(LEFT(T162,1)=\"2\",IF(COUNTA(V162:X162)=0,\"Fill in supplementary fields\",(W162+X162)*AE162*AD162))))","v":{"$error":"#VALUE!"}},{"$f":"IF(V162>W162,\"B cannot be higher than C\",IFERROR(IF(COUNTA(AA162:AB162)=0,\"Fill in supplementary fields\",IF(AA162=0,X162/2*(V162/W162)+X162/2*(1/AB162),(X162/2)*(V162/W162))),\"Fill in supplementary fields\"))+(IF(LEFT(T162,1)=\"1\",((V174*AD174)*(AE174/(1-AE174))),IF(LEFT(T162,1)=\"2\",IF(COUNTA(V162:X162)=0,\"Fill in supplementary fields\",(W162+X162)*AE162*AD162))))","v":{"$error":"#VALUE!"}},"Enter exposure values in fields A and B","Fill in supplementary fields","Fill in supplementary fields","Fill in supplementary fields","Fill in supplementary fields",0,0,0,0,0,0,0]
[null,null,null,null,null,null,null,null,null,null,null,null,null,null,null,null,null,null,"",null,null,null,null,null,null,"",null,null,null,null,null,null,null,null,null,null,null,"",159,"Fill in supplementary fields","Fill in supplementary fields",{"$f":"IF(V163>W163,\"B cannot be higher than C\",IF(COUNTA(AA163:AB163)=0,\"Fill in supplementary fields\",(X163/2)*(V163/W163)+(X163/2)*(1/SUM(AA163:AB163))))+(IF(LEFT(T163,1)=\"1\",((W163+X163)/AC163)*(V163/(W163+X163))*AD163*AE163*(AC163/(1-AE163)),IF(LEFT(T163,1)=\"2\",IF(COUNTA(V163:X163)=0,\"Fill in supplementary fields\",(W163+X163)*AE163*AD163))))","v":{"$error":"#VALUE!"}},{"$f":"IF(V163>W163,\"B cannot be higher than C\",IFERROR(IF(COUNTA(AA163:AB163)=0,\"Fill in supplementary fields\",X163/2)*(V163/W163)+(X163/2)*(1/AA163),\"Fill in supplementary fields\"))+(IF(LEFT(T163,1)=\"1\",((W163+X163)/AC163)*(V163/(W163+X163))*AD163*AE163*(AC163/(1-AE163)),IF(LEFT(T163,1)=\"2\",IF(COUNTA(V163:X163)=0,\"Fill in supplementary fields\",(W163+X163)*AE163*AD163))))","v":{"$error":"#VALUE!"}},{"$f":"IF(V163>W163,\"B cannot be higher than C\",IFERROR(IF(COUNTA(AA163:AB163)=0,\"Fill in supplementary fields\",IF(AA163=0,X163/2*(V163/W163)+X163/2*(1/AB163),(X163/2)*(V163/W163))),\"Fill in supplementary fields\"))+(IF(LEFT(T163,1)=\"1\",((W163+X163)/AC163)*(V163/(W163+X163))*AD163*AE163*(AC163/(1-AE163)),IF(LEFT(T163,1)=\"2\",IF(COUNTA(V163:X163)=0,\"Fill in supplementary fields\",(W163+X163)*AE163*AD163))))","v":{"$error":"#VALUE!"}},"Enter exposure values in fields A and B","Fill in supplementary fields","Fill in supplementary fields","Fill in supplementary fields","Fill in supplementary fields",0,0,0,0,0,0,0]
[null,null,null,null,null,null,null,null,null,null,null,null,null,null,null,null,null,null,"",null,null,null,null,null,null,"",null,null,null,null,null,null,null,null,null,null,null,"",160,"Fill in supplementary fields","Fill in supplementary fields",{"$error":"#VALUE!"},{"$error":"#VALUE!"},{"$error":"#VALUE!"},"Enter exposure values in fields A and B","Fill in supplementary fields","Fill in supplementary fields","Fill in supplementary fields","Fill in supplementary fields",0,0,0,0,0,0,0]
[null,null,null,null,null,null,null,null,null,null,null,null,null,null,null,null,null,null,"",null,null,null,null,null,null,"",null,null,null,null,null,null,null,null,null,null,null,"",161,"Fill in supplementary fields","Fill in supplementary fields",{"$f":"IF(V165>W165,\"B cannot be higher than C\",IF(COUNTA(AA165:AB165)=0,\"Fill in supplementary fields\",(X165/2)*(V165/W165)+(X165/2)*(1/SUM(AA165:AB165))))+(IF(LEFT(T165,1)=\"1\",((V177*AD177)*(AE177/(1-AE177))),IF(LEFT(T165,1)=\"2\",IF(COUNTA(V165:X165)=0,\"Fill in supplementary fields\",(W165+X165)*AE165*AD165))))","v":{"$error":"#VALUE!"}},{"$f":"IF(V165>W165,\"B cannot be higher than C\",IFERROR(IF(COUNTA(AA165:AB165)=0,\"Fill in supplementary fields\",X165/2)*(V165/W165)+(X165/2)*(1/AA165),\"Fill in supplementary fields\"))+(IF(LEFT(T165,1)=\"1\",((V177*AD177)*(AE177/(1-AE177))),IF(LEFT(T165,1)=\"2\",IF(COUNTA(V165:X165)=0,\"Fill in supplementary fields\",(W165+X165)*AE165*AD165))))","v":{"$error":"#VALUE!"}},{"$f":"IF(V165>W165,\"B cannot be higher than C\",IFERROR(IF(COUNTA(AA165:AB165)=0,\"Fill in supplementary fields\",IF(AA165=0,X165/2*(V165/W165)+X165/2*(1/AB165),(X165/2)*(V165/W165))),\"Fill in supplementary fields\"))+(IF(LEFT(T165,1)=\"1\",((V177*AD177)*(AE177/(1-AE177))),IF(LEFT(T165,1)=\"2\",IF(COUNTA(V165:X165)=0,\"Fill in supplementary fields\",(W165+X165)*AE165*AD165))))","v":{"$error":"#VALUE!"}},"Enter exposure values in fields A and B","Fill in supplementary fields","Fill in supplementary fields","Fill in supplementary fields","Fill in supplementary fields",0,0,0,0,0,0,0]
[null,null,null,null,null,null,null,null,null,null,null,null,null,null,null,null,null,null,{"$f":"IF(LEN(Q166)=0,\"\",HLOOKUP(AL166,$AN$5:$BC$200,AM166,FALSE))","v":""},null,null,null,null,null,null,"",null,null,null,null,null,null,null,null,null,null,null,{"$f":"IFERROR(VLOOKUP(Q166,BE:BF,2,FALSE),\"\")","v":""},162,{"$f":"IF(V166>W166,\"B cannot be higher than C\",IF(COUNTA(V166:X166)=0,\"Fill in supplementary fields\",IFERROR(IF(VALUE(LEFT(Z166,1))=1,X166/2+(V166/W166)*(X166/2),IF(VALUE(LEFT(Z166,1))=2,\"impossible combination\",\"check not available\")),\"\")))","v":"Fill in supplementary fields"},{"$f":"IF(V166>W166,\"B cannot be higher than C\",IF(COUNTA(V166:X166)=0,\"Fill in supplementary fields\",IFERROR(IF(VALUE(LEFT(Z166,1))=1,(V166/W166)*(X166/2),IF(VALUE(LEFT(Z166,1))=2,(V166/W166)*(X166),\"check not available\")),\"\")))","v":"Fill in supplementary fields"},{"$f":"IF(V166>W166,\"B cannot be higher than C\",IF(COUNTA(AA166:AB166)=0,\"Fill in supplementary fields\",(X166/2)*(V166/W166)+(X166/2)*(1/SUM(AA166:AB166))))+(IF(LEFT(T166,1)=\"1\",((W166+X166)/AC166)*(V166/(W166+X166))*AD166*AE166*(AC166/(1-AE166)),IF(LEFT(T166,1)=\"2\",IF(COUNTA(V166:X166)=0,\"Fill in supplementary fields\",(W166+X166)*AE166*AD166))))","v":{"$error":"#VALUE!"}},{"$f":"IF(V166>W166,\"B cannot be higher than C\",IFERROR(IF(COUNTA(AA166:AB166)=0,\"Fill in supplementary fields\",X166/2)*(V166/W166)+(X166/2)*(1/AA166),\"Fill in supplementary fields\"))+(IF(LEFT(T166,1)=\"1\",((W166+X166)/AC166)*(V166/(W166+X166))*AD166*AE166*(AC166/(1-AE166)),IF(LEFT(T166,1)=\"2\",IF(COUNTA(V166:X166)=0,\"Fill in supplementary fields\",(W166+X166)*AE166*AD166))))","v":{"$error":"#VALUE!"}},{"$f":"IF(V166>W166,\"B cannot be higher than C\",IFERROR(IF(COUNTA(AA166:AB166)=0,\"Fill in supplementary fields\",IF(AA166=0,X166/2*(V166/W166)+X166/2*(1/AB166),(X166/2)*(V166/W166))),\"Fill in supplementary fields\"))+(IF(LEFT(T166,1)=\"1\",((W166+X166)/AC166)*(V166/(W166+X166))*AD166*AE166*(AC166/(1-AE166)),IF(LEFT(T166,1)=\"2\",IF(COUNTA(V166:X166)=0,\"Fill in supplementary fields\",(W166+X166)*AE166*AD166))))","v":{"$error":"#VALUE!"}},{"$f":"IF(V166>W166,\"B cannot be higher than C\",IF(COUNTA(V166:X166)=0,\"Enter exposure values in fields A and B\",(X166)*(V166/W166)))","v":"Enter exposure values in fields A and B"},{"$f":"IF(V166>W166,\"B cannot be higher than C\",IFERROR(IF(COUNTA(AA166:AB166)=0,\"Fill in supplementary fields\",X166/2)*(V166/W166)+(X166/2)*(1/AA166),\"Fill in supplementary fields\"))","v":"Fill in supplementary fields"},{"$f":"IF(V166>W166,\"B cannot be higher than C\",IFERROR(IF(COUNTA(AA166:AB166)=0,\"Fill in supplementary fields\",IF(AA166=0,X166/2*(V166/W166)+X166/2*(1/AB166),(X166/2)*(V166/W166))),\"Fill in supplementary fields\"))","v":"Fill in supplementary fields"},{"$f":"IF(V166>W166,\"B cannot be higher than C\",IF(COUNTA(V166:X166)=0,\"Fill in supplementary fields\",(V166/W166)*((X166)+AD166*AE166)))","v":"Fill in supplementary fields"},{"$f":"IF(V166>W166,\"B cannot be higher than C\",IF(COUNTA(V166:X166)=0,\"Fill in supplementary fields\",(X166)*(V166/W166)))","v":"Fill in supplementary fields"},{"$f":"$X166","v":0},0,0,0,0,0,0]
[null,null,null,null,null,null,null,null,null,null,null,null,null,null,null,null,null,null,"",null,null,null,null,null,null,"",null,null,null,null,null,null,null,null,null,null,null,"",163,"Fill in supplementary fields","Fill in supplementary fields",{"$error":"#VALUE!"},{"$error":"#VALUE!"},{"$error":"#VALUE!"},"Enter exposure values in fields A and B","Fill in supplementary fields","Fill in supplementary fields","Fill in supplementary fields","Fill in supplementary fields",0,0,0,0,0,0,0]
[null,null,null,null,null,null,null,null,null,null,null,null,null,null,null,null,null,null,"",null,null,null,null,null,null,"",null,null,null,null,null,null,null,null,null,null,null,"",164,"Fill in supplementary fields","Fill in supplementary fields",{"$f":"IF(V168>W168,\"B cannot be higher than C\",IF(COUNTA(AA168:AB168)=0,\"Fill in supplementary fields\",(X168/2)*(V168/W168)+(X168/2)*(1/SUM(AA168:AB168))))+(IF(LEFT(T168,1)=\"1\",((V180*AD180)*(AE180/(1-AE180))),IF(LEFT(T168,1)=\"2\",IF(COUNTA(V168:X168)=0,\"Fill in supplementary fields\",(W168+X168)*AE168*AD168))))","v":{"$error":"#VALUE!"}},{"$f":"IF(V168>W168,\"B cannot be higher than C\",IFERROR(IF(COUNTA(AA168:AB168)=0,\"Fill in supplementary fields\",X168/2)*(V168/W168)+(X168/2)*(1/AA168),\"Fill in supplementary fields\"))+(IF(LEFT(T168,1)=\"1\",((V180*AD180)*(AE180/(1-AE180))),IF(LEFT(T168,1)=\"2\",IF(COUNTA(V168:X168)=0,\"Fill in supplementary fields\",(W168+X168)*AE168*AD168))))","v":{"$error":"#VALUE!"}},{"$f":"IF(V168>W168,\"B cannot be higher than C\",IFERROR(IF(COUNTA(AA168:AB168)=0,\"Fill in supplementary fields\",IF(AA168=0,X168/2*(V168/W168)+X168/2*(1/AB168),(X168/2)*(V168/W168))),\"Fill in supplementary fields\"))+(IF(LEFT(T168,1)=\"1\",((V180*AD180)*(AE180/(1-AE180))),IF(LEFT(T168,1)=\"2\",IF(COUNTA(V168:X168)=0,\"Fill in supplementary fields\",(W168+X168)*AE168*AD168))))","v":{"$error":"#VALUE!"}},"Enter exposure values in fields A and B","Fill in supplementary fields","Fill in supplementary fields","Fill in supplementary fields","Fill in supplementary fields",0,0,0,0,0,0,0]
[null,null,null,null,null,null,null,null,null,null,null,null,null,null,null,null,null,null,"",null,null,null,null,null,null,"",null,null,null,null,null,null,null,null,null,null,null,"",165,"Fill in supplementary fields","Fill in supplementary fields",{"$f":"IF(V169>W169,\"B cannot be higher than C\",IF(COUNTA(AA169:AB169)=0,\"Fill in supplementary fields\",(X169/2)*(V169/W169)+(X169/2)*(1/SUM(AA169:AB169))))+(IF(LEFT(T169,1)=\"1\",((W169+X169)/AC169)*(V169/(W169+X169))*AD169*AE169*(AC169/(1-AE169)),IF(LEFT(T169,1)=\"2\",IF(COUNTA(V169:X169)=0,\"Fill in supplementary fields\",(W169+X169)*AE169*AD169))))","v":{"$error":"#VALUE!"}},{"$f":"IF(V169>W169,\"B cannot be higher than C\",IFERROR(IF(COUNTA(AA169:AB169)=0,\"Fill in supplementary fields\",X169/2)*(V169/W169)+(X169/2)*(1/AA169),\"Fill in supplementary fields\"))+(IF(LEFT(T169,1)=\"1\",((W169+X169)/AC169)*(V169/(W169+X169))*AD169*AE169*(AC169/(1-AE169)),IF(LEFT(T169,1)=\"2\",IF(COUNTA(V169:X169)=0,\"Fill in supplementary fields\",(W169+X169)*AE169*AD169))))","v":{"$error":"#VALUE!"}},{"$f":"IF(V169>W169,\"B cannot be higher than C\",IFERROR(IF(COUNTA(AA169:AB169)=0,\"Fill in supplementary fields\",IF(AA169=0,X169/2*(V169/W169)+X169/2*(1/AB169),(X169/2)*(V169/W169))),\"Fill in supplementary fields\"))+(IF(LEFT(T169,1)=\"1\",((W169+X169)/AC169)*(V169/(W169+X169))*AD169*AE169*(AC169/(1-AE169)),IF(LEFT(T169,1)=\"2\",IF(COUNTA(V169:X169)=0,\"Fill in supplementary fields\",(W169+X169)*AE169*AD169))))","v":{"$error":"#VALUE!"}},"Enter exposure values in fields A and B","Fill in supplementary fields","Fill in supplementary fields","Fill in supplementary fields","Fill in supplementary fields",0,0,0,0,0,0,0]
[null,null,null,null,null,null,null,null,null,null,null,null,null,null,null,null,null,null,"",null,null,null,null,null,null,"",null,null,null,null,null,null,null,null,null,null,null,"",166,"Fill in supplementary fields","Fill in supplementary fields",{"$error":"#VALUE!"},{"$error":"#VALUE!"},{"$error":"#VALUE!"},"Enter exposure values in fields A and B","Fill in supplementary fields","Fill in supplementary fields","Fill in supplementary fields","Fill in supplementary fields",0,0,0,0,0,0,0]
[null,null,null,null,null,null,null,null,null,null,null,null,null,null,null,null,null,null,"",null,null,null,null,null,null,"",null,null,null,null,null,null,null,null,null,null,null,"",167,"Fill in supplementary fields","Fill in supplementary fields",{"$f":"IF(V171>W171,\"B cannot be higher than C\",IF(COUNTA(AA171:AB171)=0,\"Fill in supplementary fields\",(X171/2)*(V171/W171)+(X171/2)*(1/SUM(AA171:AB171))))+(IF(LEFT(T171,1)=\"1\",((V183*AD183)*(AE183/(1-AE183))),IF(LEFT(T171,1)=\"2\",IF(COUNTA(V171:X171)=0,\"Fill in supplementary fields\",(W171+X171)*AE171*AD171))))","v":{"$error":"#VALUE!"}},{"$f":"IF(V171>W171,\"B cannot be higher than C\",IFERROR(IF(COUNTA(AA171:AB171)=0,\"Fill in supplementary fields\",X171/2)*(V171/W171)+(X171/2)*(1/AA171),\"Fill in supplementary fields\"))+(IF(LEFT(T171,1)=\"1\",((V183*AD183)*(AE183/(1-AE183))),IF(LEFT(T171,1)=\"2\",IF(COUNTA(V171:X171)=0,\"Fill in supplementary fields\",(W171+X171)*AE171*AD171))))","v":{"$error":"#VALUE!"}},{"$f":"IF(V171>W171,\"B cannot be higher than C\",IFERROR(IF(COUNTA(AA171:AB171)=0,\"Fill in supplementary fields\",IF(AA171=0,X171/2*(V171/W171)+X171/2*(1/AB171),(X171/2)*(V171/W171))),\"Fill in supplementary fields\"))+(IF(LEFT(T171,1)=\"1\",((V183*AD183)*(AE183/(1-AE183))),IF(LEFT(T171,1)=\"2\",IF(COUNTA(V171:X171)=0,\"Fill in supplementary fields\",(W171+X171)*AE171*AD171))))","v":{"$error":"#VALUE!"}},"Enter exposure values in fields A and B","Fill in supplementary fields","Fill in supplementary fields","Fill in supplementary fields","Fill in supplementary fields",0,0,0,0,0,0,0]
[null,null,null,null,null,null,null,null,null,null,null,null,null,null,null,null,null,null,"",null,null,null,null,null,null,"",null,null,null,null,null,null,null,null,null,null,null,"",168,"Fill in supplementary fields","Fill in supplementary fields",{"$f":"IF(V172>W172,\"B cannot be higher than C\",IF(COUNTA(AA172:AB172)=0,\"Fill in supplementary fields\",(X172/2)*(V172/W172)+(X172/2)*(1/SUM(AA172:AB172))))+(IF(LEFT(T172,1)=\"1\",((W172+X172)/AC172)*(V172/(W172+X172))*AD172*AE172*(AC172/(1-AE172)),IF(LEFT(T172,1)=\"2\",IF(COUNTA(V172:X172)=0,\"Fill in supplementary fields\",(W172+X172)*AE172*AD172))))","v":{"$error":"#VALUE!"}},{"$f":"IF(V172>W172,\"B cannot be higher than C\",IFERROR(IF(COUNTA(AA172:AB172)=0,\"Fill in supplementary fields\",X172/2)*(V172/W172)+(X172/2)*(1/AA172),\"Fill in supplementary fields\"))+(IF(LEFT(T172,1)=\"1\",((W172+X172)/AC172)*(V172/(W172+X172))*AD172*AE172*(AC172/(1-AE172)),IF(LEFT(T172,1)=\"2\",IF(COUNTA(V172:X172)=0,\"Fill in supplementary fields\",(W172+X172)*AE172*AD172))))","v":{"$error":"#VALUE!"}},{"$f":"IF(V172>W172,\"B cannot be higher than C\",IFERROR(IF(COUNTA(AA172:AB172)=0,\"Fill in supplementary fields\",IF(AA172=0,X172/2*(V172/W172)+X172/2*(1/AB172),(X172/2)*(V172/W172))),\"Fill in supplementary fields\"))+(IF(LEFT(T172,1)=\"1\",((W172+X172)/AC172)*(V172/(W172+X172))*AD172*AE172*(AC172/(1-AE172)),IF(LEFT(T172,1)=\"2\",IF(COUNTA(V172:X172)=0,\"Fill in supplementary fields\",(W172+X172)*AE172*AD172))))","v":{"$error":"#VALUE!"}},"Enter exposure values in fields A and B","Fill in supplementary fields","Fill in supplementary fields","Fill in supplementary fields","Fill in supplementary fields",0,0,0,0,0,0,0]
[null,null,null,null,null,null,null,null,null,null,null,null,null,null,null,null,null,null,"",null,null,null,null,null,null,"",null,null,null,null,null,null,null,null,null,null,null,"",169,"Fill in supplementary fields","Fill in supplementary fields",{"$error":"#VALUE!"},{"$error":"#VALUE!"},{"$error":"#VALUE!"},"Enter exposure values in fields A and B","Fill in supplementary fields","Fill in supplementary fields","Fill in supplementary fields","Fill in supplementary fields",0,0,0,0,0,0,0]
[null,null,null,null,null,null,null,null,null,null,null,null,null,null,null,null,null,null,"",null,null,null,null,null,null,"",null,null,null,null,null,null,null,null,null,null,null,"",170,"Fill in supplementary fields","Fill in supplementary fields",{"$f":"IF(V174>W174,\"B cannot be higher than C\",IF(COUNTA(AA174:AB174)=0,\"Fill in supplementary fields\",(X174/2)*(V174/W174)+(X174/2)*(1/SUM(AA174:AB174))))+(IF(LEFT(T174,1)=\"1\",((V186*AD186)*(AE186/(1-AE186))),IF(LEFT(T174,1)=\"2\",IF(COUNTA(V174:X174)=0,\"Fill in supplementary fields\",(W174+X174)*AE174*AD174))))","v":{"$error":"#VALUE!"}},{"$f":"IF(V174>W174,\"B cannot be higher than C\",IFERROR(IF(COUNTA(AA174:AB174)=0,\"Fill in supplementary fields\",X174/2)*(V174/W174)+(X174/2)*(1/AA174),\"Fill in supplementary fields\"))+(IF(LEFT(T174,1)=\"1\",((V186*AD186)*(AE186/(1-AE186))),IF(LEFT(T174,1)=\"2\",IF(COUNTA(V174:X174)=0,\"Fill in supplementary fields\",(W174+X174)*AE174*AD174))))","v":{"$error":"#VALUE!"}},{"$f":"IF(V174>W174,\"B cannot be higher than C\",IFERROR(IF(COUNTA(AA174:AB174)=0,\"Fill in supplementary fields\",IF(AA174=0,X174/2*(V174/W174)+X174/2*(1/AB174),(X174/2)*(V174/W174))),\"Fill in supplementary fields\"))+(IF(LEFT(T174,1)=\"1\",((V186*AD186)*(AE186/(1-AE186))),IF(LEFT(T174,1)=\"2\",IF(COUNTA(V174:X174)=0,\"Fill in supplementary fields\",(W174+X174)*AE174*AD174))))","v":{"$error":"#VALUE!"}},"Enter exposure values in fields A and B","Fill in supplementary fields","Fill in supplementary fields","Fill in supplementary fields","Fill in supplementary fields",0,0,0,0,0,0,0]
[null,null,null,null,null,null,null,null,null,null,null,null,null,null,null,null,null,null,"",null,null,null,null,null,null,"",null,null,null,null,null,null,null,null,null,null,null,"",171,"Fill in supplementary fields","Fill in supplementary fields",{"$f":"IF(V175>W175,\"B cannot be higher than C\",IF(COUNTA(AA175:AB175)=0,\"Fill in supplementary fields\",(X175/2)*(V175/W175)+(X175/2)*(1/SUM(AA175:AB175))))+(IF(LEFT(T175,1)=\"1\",((W175+X175)/AC175)*(V175/(W175+X175))*AD175*AE175*(AC175/(1-AE175)),IF(LEFT(T175,1)=\"2\",IF(COUNTA(V175:X175)=0,\"Fill in supplementary fields\",(W175+X175)*AE175*AD175))))","v":{"$error":"#VALUE!"}},{"$f":"IF(V175>W175,\"B cannot be higher than C\",IFERROR(IF(COUNTA(AA175:AB175)=0,\"Fill in supplementary fields\",X175/2)*(V175/W175)+(X175/2)*(1/AA175),\"Fill in supplementary fields\"))+(IF(LEFT(T175,1)=\"1\",((W175+X175)/AC175)*(V175/(W175+X175))*AD175*AE175*(AC175/(1-AE175)),IF(LEFT(T175,1)=\"2\",IF(COUNTA(V175:X175)=0,\"Fill in supplementary fields\",(W175+X175)*AE175*AD175))))","v":{"$error":"#VALUE!"}},{"$f":"IF(V175>W175,\"B cannot be higher than C\",IFERROR(IF(COUNTA(AA175:AB175)=0,\"Fill in supplementary fields\",IF(AA175=0,X175/2*(V175/W175)+X175/2*(1/AB175),(X175/2)*(V175/W175))),\"Fill in supplementary fields\"))+(IF(LEFT(T175,1)=\"1\",((W175+X175)/AC175)*(V175/(W175+X175))*AD175*AE175*(AC175/(1-AE175)),IF(LEFT(T175,1)=\"2\",IF(COUNTA(V175:X175)=0,\"Fill in supplementary fields\",(W175+X175)*AE175*AD175))))","v":{"$error":"#VALUE!"}},"Enter exposure values in fields A and B","Fill in supplementary fields","Fill in supplementary fields","Fill in supplementary fields","Fill in supplementary fields",0,0,0,0,0,0,0]
[null,null,null,null,null,null,null,null,null,null,null,null,null,null,null,null,null,null,"",null,null,null,null,null,null,"",null,null,null,null,null,null,null,null,null,null,null,"",172,"Fill in supplementary fields","Fill in supplementary fields",{"$error":"#VALUE!"},{"$error":"#VALUE!"},{"$error":"#VALUE!"},"Enter exposure values in fields A and B","Fill in supplementary fields","Fill in supplementary fields","Fill in supplementary fields","Fill in supplementary fields",0,0,0,0,0,0,0]
[null,null,null,null,null,null,null,null,null,null,null,null,null,null,null,null,null,null,"",null,null,null,null,null,null,"",null,null,null,null,null,null,null,null,null,null,null,"",173,"Fill in supplementary fields","Fill in supplementary fields",{"$f":"IF(V177>W177,\"B cannot be higher than C\",IF(COUNTA(AA177:AB177)=0,\"Fill in supplementary fields\",(X177/2)*(V177/W177)+(X177/2)*(1/SUM(AA177:AB177))))+(IF(LEFT(T177,1)=\"1\",((V189*AD189)*(AE189/(1-AE189))),IF(LEFT(T177,1)=\"2\",IF(COUNTA(V177:X177)=0,\"Fill in supplementary fields\",(W177+X177)*AE177*AD177))))","v":{"$error":"#VALUE!"}},{"$f":"IF(V177>W177,\"B cannot be higher than C\",IFERROR(IF(COUNTA(AA177:AB177)=0,\"Fill in supplementary fields\",X177/2)*(V177/W177)+(X177/2)*(1/AA177),\"Fill in supplementary fields\"))+(IF(LEFT(T177,1)=\"1\",((V189*AD189)*(AE189/(1-AE189))),IF(LEFT(T177,1)=\"2\",IF(COUNTA(V177:X177)=0,\"Fill in supplementary fields\",(W177+X177)*AE177*AD177))))","v":{"$error":"#VALUE!"}},{"$f":"IF(V177>W177,\"B cannot be higher than C\",IFERROR(IF(COUNTA(AA177:AB177)=0,\"Fill in supplementary fields\",IF(AA177=0,X177/2*(V177/W177)+X177/2*(1/AB177),(X177/2)*(V177/W177))),\"Fill in supplementary fields\"))+(IF(LEFT(T177,1)=\"1\",((V189*AD189)*(AE189/(1-AE189))),IF(LEFT(T177,1)=\"2\",IF(COUNTA(V177:X177)=0,\"Fill in supplementary fields\",(W177+X177)*AE177*AD177))))","v":{"$error":"#VALUE!"}},"Enter exposure values in fields A and B","Fill in supplementary fields","Fill in supplementary fields","Fill in supplementary fields","Fill in supplementary fields",0,0,0,0,0,0,0]
[null,null,null,null,null,null,null,null,null,null,null,null,null,null,null,null,null,null,"",null,null,null,null,null,null,"",null,null,null,null,null,null,null,null,null,null,null,"",174,"Fill in supplementary fields","Fill in supplementary fields",{"$f":"IF(V178>W178,\"B cannot be higher than C\",IF(COUNTA(AA178:AB178)=0,\"Fill in supplementary fields\",(X178/2)*(V178/W178)+(X178/2)*(1/SUM(AA178:AB178))))+(IF(LEFT(T178,1)=\"1\",((W178+X178)/AC178)*(V178/(W178+X178))*AD178*AE178*(AC178/(1-AE178)),IF(LEFT(T178,1)=\"2\",IF(COUNTA(V178:X178)=0,\"Fill in supplementary fields\",(W178+X178)*AE178*AD178))))","v":{"$error":"#VALUE!"}},{"$f":"IF(V178>W178,\"B cannot be higher than C\",IFERROR(IF(COUNTA(AA178:AB178)=0,\"Fill in supplementary fields\",X178/2)*(V178/W178)+(X178/2)*(1/AA178),\"Fill in supplementary fields\"))+(IF(LEFT(T178,1)=\"1\",((W178+X178)/AC178)*(V178/(W178+X178))*AD178*AE178*(AC178/(1-AE178)),IF(LEFT(T178,1)=\"2\",IF(COUNTA(V178:X178)=0,\"Fill in supplementary fields\",(W178+X178)*AE178*AD178))))","v":{"$error":"#VALUE!"}},{"$f":"IF(V178>W178,\"B cannot be higher than C\",IFERROR(IF(COUNTA(AA178:AB178)=0,\"Fill in supplementary fields\",IF(AA178=0,X178/2*(V178/W178)+X178/2*(1/AB178),(X178/2)*(V178/W178))),\"Fill in supplementary fields\"))+(IF(LEFT(T178,1)=\"1\",((W178+X178)/AC178)*(V178/(W178+X178))*AD178*AE178*(AC178/(1-AE178)),IF(LEFT(T178,1)=\"2\",IF(COUNTA(V178:X178)=0,\"Fill in supplementary fields\",(W178+X178)*AE178*AD178))))","v":{"$error":"#VALUE!"}},"Enter exposure values in fields A and B","Fill in supplementary fields","Fill in supplementary fields","Fill in supplementary fields","Fill in supplementary fields",0,0,0,0,0,0,0]
[null,null,null,null,null,null,null,null,null,null,null,null,null,null,null,null,null,null,"",null,null,null,null,null,null,"",null,null,null,null,null,null,null,null,null,null,null,"",175,"Fill in supplementary fields","Fill in supplementary fields",{"$error":"#VALUE!"},{"$error":"#VALUE!"},{"$error":"#VALUE!"},"Enter exposure values in fields A and B","Fill in supplementary fields","Fill in supplementary fields","Fill in supplementary fields","Fill in supplementary fields",0,0,0,0,0,0,0]
[null,null,null,null,null,null,null,null,null,null,null,null,null,null,null,null,null,null,"",null,null,null,null,null,null,"",null,null,null,null,null,null,null,null,null,null,null,"",176,"Fill in supplementary fields","Fill in supplementary fields",{"$f":"IF(V180>W180,\"B cannot be higher than C\",IF(COUNTA(AA180:AB180)=0,\"Fill in supplementary fields\",(X180/2)*(V180/W180)+(X180/2)*(1/SUM(AA180:AB180))))+(IF(LEFT(T180,1)=\"1\",((V192*AD192)*(AE192/(1-AE192))),IF(LEFT(T180,1)=\"2\",IF(COUNTA(V180:X180)=0,\"Fill in supplementary fields\",(W180+X180)*AE180*AD180))))","v":{"$error":"#VALUE!"}},{"$f":"IF(V180>W180,\"B cannot be higher than C\",IFERROR(IF(COUNTA(AA180:AB180)=0,\"Fill in supplementary fields\",X180/2)*(V180/W180)+(X180/2)*(1/AA180),\"Fill in supplementary fields\"))+(IF(LEFT(T180,1)=\"1\",((V192*AD192)*(AE192/(1-AE192))),IF(LEFT(T180,1)=\"2\",IF(COUNTA(V180:X180)=0,\"Fill in supplementary fields\",(W180+X180)*AE180*AD180))))","v":{"$error":"#VALUE!"}},{"$f":"IF(V180>W180,\"B cannot be higher than C\",IFERROR(IF(COUNTA(AA180:AB180)=0,\"Fill in supplementary fields\",IF(AA180=0,X180/2*(V180/W180)+X180/2*(1/AB180),(X180/2)*(V180/W180))),\"Fill in supplementary fields\"))+(IF(LEFT(T180,1)=\"1\",((V192*AD192)*(AE192/(1-AE192))),IF(LEFT(T180,1)=\"2\",IF(COUNTA(V180:X180)=0,\"Fill in supplementary fields\",(W180+X180)*AE180*AD180))))","v":{"$error":"#VALUE!"}},"Enter exposure values in fields A and B","Fill in supplementary fields","Fill in supplementary fields","Fill in supplementary fields","Fill in supplementary fields",0,0,0,0,0,0,0]
[null,null,null,null,null,null,null,null,null,null,null,null,null,null,null,null,null,null,"",null,null,null,null,null,null,"",null,null,null,null,null,null,null,null,null,null,null,"",177,"Fill in supplementary fields","Fill in supplementary fields",{"$f":"IF(V181>W181,\"B cannot be higher than C\",IF(COUNTA(AA181:AB181)=0,\"Fill in supplementary fields\",(X181/2)*(V181/W181)+(X181/2)*(1/SUM(AA181:AB181))))+(IF(LEFT(T181,1)=\"1\",((W181+X181)/AC181)*(V181/(W181+X181))*AD181*AE181*(AC181/(1-AE181)),IF(LEFT(T181,1)=\"2\",IF(COUNTA(V181:X181)=0,\"Fill in supplementary fields\",(W181+X181)*AE181*AD181))))","v":{"$error":"#VALUE!"}},{"$f":"IF(V181>W181,\"B cannot be higher than C\",IFERROR(IF(COUNTA(AA181:AB181)=0,\"Fill in supplementary fields\",X181/2)*(V181/W181)+(X181/2)*(1/AA181),\"Fill in supplementary fields\"))+(IF(LEFT(T181,1)=\"1\",((W181+X181)/AC181)*(V181/(W181+X181))*AD181*AE181*(AC181/(1-AE181)),IF(LEFT(T181,1)=\"2\",IF(COUNTA(V181:X181)=0,\"Fill in supplementary fields\",(W181+X181)*AE181*AD181))))","v":{"$error":"#VALUE!"}},{"$f":"IF(V181>W181,\"B cannot be higher than C\",IFERROR(IF(COUNTA(AA181:AB181)=0,\"Fill in supplementary fields\",IF(AA181=0,X181/2*(V181/W181)+X181/2*(1/AB181),(X181/2)*(V181/W181))),\"Fill in supplementary fields\"))+(IF(LEFT(T181,1)=\"1\",((W181+X181)/AC181)*(V181/(W181+X181))*AD181*AE181*(AC181/(1-AE181)),IF(LEFT(T181,1)=\"2\",IF(COUNTA(V181:X181)=0,\"Fill in supplementary fields\",(W181+X181)*AE181*AD181))))","v":{"$error":"#VALUE!"}},"Enter exposure values in fields A and B","Fill in supplementary fields","Fill in supplementary fields","Fill in supplementary fields","Fill in supplementary fields",0,0,0,0,0,0,0]
[null,null,null,null,null,null,null,null,null,null,null,null,null,null,null,null,null,null,"",null,null,null,null,null,null,"",null,null,null,null,null,null,null,null,null,null,null,"",178,"Fill in supplementary fields","Fill in supplementary fields",{"$error":"#VALUE!"},{"$error":"#VALUE!"},{"$error":"#VALUE!"},"Enter exposure values in fields A and B","Fill in supplementary fields","Fill in supplementary fields","Fill in supplementary fields","Fill in supplementary fields",{"$f":"$X182","v":0},0,0,0,0,0,0]
[null,null,null,null,null,null,null,null,null,null,null,null,null,null,null,null,null,null,"",null,null,null,null,null,null,"",null,null,null,null,null,null,null,null,null,null,null,"",179,"Fill in supplementary fields","Fill in supplementary fields",{"$f":"IF(V183>W183,\"B cannot be higher than C\",IF(COUNTA(AA183:AB183)=0,\"Fill in supplementary fields\",(X183/2)*(V183/W183)+(X183/2)*(1/SUM(AA183:AB183))))+(IF(LEFT(T183,1)=\"1\",((V195*AD195)*(AE195/(1-AE195))),IF(LEFT(T183,1)=\"2\",IF(COUNTA(V183:X183)=0,\"Fill in supplementary fields\",(W183+X183)*AE183*AD183))))","v":{"$error":"#VALUE!"}},{"$f":"IF(V183>W183,\"B cannot be higher than C\",IFERROR(IF(COUNTA(AA183:AB183)=0,\"Fill in supplementary fields\",X183/2)*(V183/W183)+(X183/2)*(1/AA183),\"Fill in supplementary fields\"))+(IF(LEFT(T183,1)=\"1\",((V195*AD195)*(AE195/(1-AE195))),IF(LEFT(T183,1)=\"2\",IF(COUNTA(V183:X183)=0,\"Fill in supplementary fields\",(W183+X183)*AE183*AD183))))","v":{"$error":"#VALUE!"}},{"$f":"IF(V183>W183,\"B cannot be higher than C\",IFERROR(IF(COUNTA(AA183:AB183)=0,\"Fill in supplementary fields\",IF(AA183=0,X183/2*(V183/W183)+X183/2*(1/AB183),(X183/2)*(V183/W183))),\"Fill in supplementary fields\"))+(IF(LEFT(T183,1)=\"1\",((V195*AD195)*(AE195/(1-AE195))),IF(LEFT(T183,1)=\"2\",IF(COUNTA(V183:X183)=0,\"Fill in supplementary fields\",(W183+X183)*AE183*AD183))))","v":{"$error":"#VALUE!"}},"Enter exposure values in fields A and B","Fill in supplementary fields","Fill in supplementary fields","Fill in supplementary fields","Fill in supplementary fields",0,0,0,0,0,0,0]
[null,null,null,null,null,null,null,null,null,null,null,null,null,null,null,null,null,null,"",null,null,null,null,null,null,"",null,null,null,null,null,null,null,null,null,null,null,"",180,"Fill in supplementary fields","Fill in supplementary fields",{"$f":"IF(V184>W184,\"B cannot be higher than C\",IF(COUNTA(AA184:AB184)=0,\"Fill in supplementary fields\",(X184/2)*(V184/W184)+(X184/2)*(1/SUM(AA184:AB184))))+(IF(LEFT(T184,1)=\"1\",((W184+X184)/AC184)*(V184/(W184+X184))*AD184*AE184*(AC184/(1-AE184)),IF(LEFT(T184,1)=\"2\",IF(COUNTA(V184:X184)=0,\"Fill in supplementary fields\",(W184+X184)*AE184*AD184))))","v":{"$error":"#VALUE!"}},{"$f":"IF(V184>W184,\"B cannot be higher than C\",IFERROR(IF(COUNTA(AA184:AB184)=0,\"Fill in supplementary fields\",X184/2)*(V184/W184)+(X184/2)*(1/AA184),\"Fill in supplementary fields\"))+(IF(LEFT(T184,1)=\"1\",((W184+X184)/AC184)*(V184/(W184+X184))*AD184*AE184*(AC184/(1-AE184)),IF(LEFT(T184,1)=\"2\",IF(COUNTA(V184:X184)=0,\"Fill in supplementary fields\",(W184+X184)*AE184*AD184))))","v":{"$error":"#VALUE!"}},{"$f":"IF(V184>W184,\"B cannot be higher than C\",IFERROR(IF(COUNTA(AA184:AB184)=0,\"Fill in supplementary fields\",IF(AA184=0,X184/2*(V184/W184)+X184/2*(1/AB184),(X184/2)*(V184/W184))),\"Fill in supplementary fields\"))+(IF(LEFT(T184,1)=\"1\",((W184+X184)/AC184)*(V184/(W184+X184))*AD184*AE184*(AC184/(1-AE184)),IF(LEFT(T184,1)=\"2\",IF(COUNTA(V184:X184)=0,\"Fill in supplementary fields\",(W184+X184)*AE184*AD184))))","v":{"$error":"#VALUE!"}},"Enter exposure values in fields A and B","Fill in supplementary fields","Fill in supplementary fields","Fill in supplementary fields","Fill in supplementary fields",0,0,0,0,0,0,0]
[null,null,null,null,null,null,null,null,null,null,null,null,null,null,null,null,null,null,"",null,null,null,null,null,null,"",null,null,null,null,null,null,null,null,null,null,null,"",181,"Fill in supplementary fields","Fill in supplementary fields",{"$error":"#VALUE!"},{"$error":"#VALUE!"},{"$error":"#VALUE!"},"Enter exposure values in fields A and B","Fill in supplementary fields","Fill in supplementary fields","Fill in supplementary fields","Fill in supplementary fields",0,0,0,0,0,0,0]
[null,null,null,null,null,null,null,null,null,null,null,null,null,null,null,null,null,null,"",null,null,null,null,null,null,"",null,null,null,null,null,null,null,null,null,null,null,"",182,"Fill in supplementary fields","Fill in supplementary fields",{"$f":"IF(V186>W186,\"B cannot be higher than C\",IF(COUNTA(AA186:AB186)=0,\"Fill in supplementary fields\",(X186/2)*(V186/W186)+(X186/2)*(1/SUM(AA186:AB186))))+(IF(LEFT(T186,1)=\"1\",((V198*AD198)*(AE198/(1-AE198))),IF(LEFT(T186,1)=\"2\",IF(COUNTA(V186:X186)=0,\"Fill in supplementary fields\",(W186+X186)*AE186*AD186))))","v":{"$error":"#VALUE!"}},{"$f":"IF(V186>W186,\"B cannot be higher than C\",IFERROR(IF(COUNTA(AA186:AB186)=0,\"Fill in supplementary fields\",X186/2)*(V186/W186)+(X186/2)*(1/AA186),\"Fill in supplementary fields\"))+(IF(LEFT(T186,1)=\"1\",((V198*AD198)*(AE198/(1-AE198))),IF(LEFT(T186,1)=\"2\",IF(COUNTA(V186:X186)=0,\"Fill in supplementary fields\",(W186+X186)*AE186*AD186))))","v":{"$error":"#VALUE!"}},{"$f":"IF(V186>W186,\"B cannot be higher than C\",IFERROR(IF(COUNTA(AA186:AB186)=0,\"Fill in supplementary fields\",IF(AA186=0,X186/2*(V186/W186)+X186/2*(1/AB186),(X186/2)*(V186/W186))),\"Fill in supplementary fields\"))+(IF(LEFT(T186,1)=\"1\",((V198*AD198)*(AE198/(1-AE198))),IF(LEFT(T186,1)=\"2\",IF(COUNTA(V186:X186)=0,\"Fill in supplementary fields\",(W186+X186)*AE186*AD186))))","v":{"$error":"#VALUE!"}},"Enter exposure values in fields A and B","Fill in supplementary fields","Fill in supplementary fields","Fill in supplementary fields","Fill in supplementary fields",0,0,0,0,0,0,0]
[null,null,null,null,null,null,null,null,null,null,null,null,null,null,null,null,null,null,"",null,null,null,null,null,null,"",null,null,null,null,null,null,null,null,null,null,null,"",183,"Fill in supplementary fields","Fill in supplementary fields",{"$f":"IF(V187>W187,\"B cannot be higher than C\",IF(COUNTA(AA187:AB187)=0,\"Fill in supplementary fields\",(X187/2)*(V187/W187)+(X187/2)*(1/SUM(AA187:AB187))))+(IF(LEFT(T187,1)=\"1\",((W187+X187)/AC187)*(V187/(W187+X187))*AD187*AE187*(AC187/(1-AE187)),IF(LEFT(T187,1)=\"2\",IF(COUNTA(V187:X187)=0,\"Fill in supplementary fields\",(W187+X187)*AE187*AD187))))","v":{"$error":"#VALUE!"}},{"$f":"IF(V187>W187,\"B cannot be higher than C\",IFERROR(IF(COUNTA(AA187:AB187)=0,\"Fill in supplementary fields\",X187/2)*(V187/W187)+(X187/2)*(1/AA187),\"Fill in supplementary fields\"))+(IF(LEFT(T187,1)=\"1\",((W187+X187)/AC187)*(V187/(W187+X187))*AD187*AE187*(AC187/(1-AE187)),IF(LEFT(T187,1)=\"2\",IF(COUNTA(V187:X187)=0,\"Fill in supplementary fields\",(W187+X187)*AE187*AD187))))","v":{"$error":"#VALUE!"}},{"$f":"IF(V187>W187,\"B cannot be higher than C\",IFERROR(IF(COUNTA(AA187:AB187)=0,\"Fill in supplementary fields\",IF(AA187=0,X187/2*(V187/W187)+X187/2*(1/AB187),(X187/2)*(V187/W187))),\"Fill in supplementary fields\"))+(IF(LEFT(T187,1)=\"1\",((W187+X187)/AC187)*(V187/(W187+X187))*AD187*AE187*(AC187/(1-AE187)),IF(LEFT(T187,1)=\"2\",IF(COUNTA(V187:X187)=0,\"Fill in supplementary fields\",(W187+X187)*AE187*AD187))))","v":{"$error":"#VALUE!"}},"Enter exposure values in fields A and B","Fill in supplementary fields","Fill in supplementary fields","Fill in supplementary fields","Fill in supplementary fields",0,0,0,0,0,0,0]
[null,null,null,null,null,null,null,null,null,null,null,null,null,null,null,null,null,null,"",null,null,null,null,null,null,"",null,null,null,null,null,null,null,null,null,null,null,"",184,"Fill in supplementary fields","Fill in supplementary fields",{"$error":"#VALUE!"},{"$error":"#VALUE!"},{"$error":"#VALUE!"},"Enter exposure values in fields A and B","Fill in supplementary fields","Fill in supplementary fields","Fill in supplementary fields","Fill in supplementary fields",0,0,0,0,0,0,0]
[null,null,null,null,null,null,null,null,null,null,null,null,null,null,null,null,null,null,"",null,null,null,null,null,null,"",null,null,null,null,null,null,null,null,null,null,null,"",185,"Fill in supplementary fields","Fill in supplementary fields",{"$f":"IF(V189>W189,\"B cannot be higher than C\",IF(COUNTA(AA189:AB189)=0,\"Fill in supplementary fields\",(X189/2)*(V189/W189)+(X189/2)*(1/SUM(AA189:AB189))))+(IF(LEFT(T189,1)=\"1\",((V201*AD201)*(AE201/(1-AE201))),IF(LEFT(T189,1)=\"2\",IF(COUNTA(V189:X189)=0,\"Fill in supplementary fields\",(W189+X189)*AE189*AD189))))","v":{"$error":"#VALUE!"}},{"$f":"IF(V189>W189,\"B cannot be higher than C\",IFERROR(IF(COUNTA(AA189:AB189)=0,\"Fill in supplementary fields\",X189/2)*(V189/W189)+(X189/2)*(1/AA189),\"Fill in supplementary fields\"))+(IF(LEFT(T189,1)=\"1\",((V201*AD201)*(AE201/(1-AE201))),IF(LEFT(T189,1)=\"2\",IF(COUNTA(V189:X189)=0,\"Fill in supplementary fields\",(W189+X189)*AE189*AD189))))","v":{"$error":"#VALUE!"}},{"$f":"IF(V189>W189,\"B cannot be higher than C\",IFERROR(IF(COUNTA(AA189:AB189)=0,\"Fill in supplementary fields\",IF(AA189=0,X189/2*(V189/W189)+X189/2*(1/AB189),(X189/2)*(V189/W189))),\"Fill in supplementary fields\"))+(IF(LEFT(T189,1)=\"1\",((V201*AD201)*(AE201/(1-AE201))),IF(LEFT(T189,1)=\"2\",IF(COUNTA(V189:X189)=0,\"Fill in supplementary fields\",(W189+X189)*AE189*AD189))))","v":{"$error":"#VALUE!"}},"Enter exposure values in fields A and B","Fill in supplementary fields","Fill in supplementary fields","Fill in supplementary fields","Fill in supplementary fields",0,0,0,0,0,0,0]
[null,null,null,null,null,null,null,null,null,null,null,null,null,null,null,null,null,null,"",null,null,null,null,null,null,"",null,null,null,null,null,null,null,null,null,null,null,"",186,"Fill in supplementary fields","Fill in supplementary fields",{"$f":"IF(V190>W190,\"B cannot be higher than C\",IF(COUNTA(AA190:AB190)=0,\"Fill in supplementary fields\",(X190/2)*(V190/W190)+(X190/2)*(1/SUM(AA190:AB190))))+(IF(LEFT(T190,1)=\"1\",((W190+X190)/AC190)*(V190/(W190+X190))*AD190*AE190*(AC190/(1-AE190)),IF(LEFT(T190,1)=\"2\",IF(COUNTA(V190:X190)=0,\"Fill in supplementary fields\",(W190+X190)*AE190*AD190))))","v":{"$error":"#VALUE!"}},{"$f":"IF(V190>W190,\"B cannot be higher than C\",IFERROR(IF(COUNTA(AA190:AB190)=0,\"Fill in supplementary fields\",X190/2)*(V190/W190)+(X190/2)*(1/AA190),\"Fill in supplementary fields\"))+(IF(LEFT(T190,1)=\"1\",((W190+X190)/AC190)*(V190/(W190+X190))*AD190*AE190*(AC190/(1-AE190)),IF(LEFT(T190,1)=\"2\",IF(COUNTA(V190:X190)=0,\"Fill in supplementary fields\",(W190+X190)*AE190*AD190))))","v":{"$error":"#VALUE!"}},{"$f":"IF(V190>W190,\"B cannot be higher than C\",IFERROR(IF(COUNTA(AA190:AB190)=0,\"Fill in supplementary fields\",IF(AA190=0,X190/2*(V190/W190)+X190/2*(1/AB190),(X190/2)*(V190/W190))),\"Fill in supplementary fields\"))+(IF(LEFT(T190,1)=\"1\",((W190+X190)/AC190)*(V190/(W190+X190))*AD190*AE190*(AC190/(1-AE190)),IF(LEFT(T190,1)=\"2\",IF(COUNTA(V190:X190)=0,\"Fill in supplementary fields\",(W190+X190)*AE190*AD190))))","v":{"$error":"#VALUE!"}},"Enter exposure values in fields A and B","Fill in supplementary fields","Fill in supplementary fields","Fill in supplementary fields","Fill in supplementary fields",0,0,0,0,0,0,0]
[null,null,null,null,null,null,null,null,null,null,null,null,null,null,null,null,null,null,"",null,null,null,null,null,null,"",null,null,null,null,null,null,null,null,null,null,null,"",187,"Fill in supplementary fields","Fill in supplementary fields",{"$error":"#VALUE!"},{"$error":"#VALUE!"},{"$error":"#VALUE!"},"Enter exposure values in fields A and B","Fill in supplementary fields","Fill in supplementary fields","Fill in supplementary fields","Fill in supplementary fields",0,0,0,0,0,0,0]
[null,null,null,null,null,null,null,null,null,null,null,null,null,null,null,null,null,null,"",null,null,null,null,null,null,"",null,null,null,null,null,null,null,null,null,null,null,"",188,"Fill in supplementary fields","Fill in supplementary fields",{"$f":"IF(V192>W192,\"B cannot be higher than C\",IF(COUNTA(AA192:AB192)=0,\"Fill in supplementary fields\",(X192/2)*(V192/W192)+(X192/2)*(1/SUM(AA192:AB192))))+(IF(LEFT(T192,1)=\"1\",((V204*AD204)*(AE204/(1-AE204))),IF(LEFT(T192,1)=\"2\",IF(COUNTA(V192:X192)=0,\"Fill in supplementary fields\",(W192+X192)*AE192*AD192))))","v":{"$error":"#VALUE!"}},{"$f":"IF(V192>W192,\"B cannot be higher than C\",IFERROR(IF(COUNTA(AA192:AB192)=0,\"Fill in supplementary fields\",X192/2)*(V192/W192)+(X192/2)*(1/AA192),\"Fill in supplementary fields\"))+(IF(LEFT(T192,1)=\"1\",((V204*AD204)*(AE204/(1-AE204))),IF(LEFT(T192,1)=\"2\",IF(COUNTA(V192:X192)=0,\"Fill in supplementary fields\",(W192+X192)*AE192*AD192))))","v":{"$error":"#VALUE!"}},{"$f":"IF(V192>W192,\"B cannot be higher than C\",IFERROR(IF(COUNTA(AA192:AB192)=0,\"Fill in supplementary fields\",IF(AA192=0,X192/2*(V192/W192)+X192/2*(1/AB192),(X192/2)*(V192/W192))),\"Fill in supplementary fields\"))+(IF(LEFT(T192,1)=\"1\",((V204*AD204)*(AE204/(1-AE204))),IF(LEFT(T192,1)=\"2\",IF(COUNTA(V192:X192)=0,\"Fill in supplementary fields\",(W192+X192)*AE192*AD192))))","v":{"$error":"#VALUE!"}},"Enter exposure values in fields A and B","Fill in supplementary fields","Fill in supplementary fields","Fill in supplementary fields","Fill in supplementary fields",0,0,0,0,0,0,0]
[null,null,null,null,null,null,null,null,null,null,null,null,null,null,null,null,null,null,"",null,null,null,null,null,null,"",null,null,null,null,null,null,null,null,null,null,null,"",189,"Fill in supplementary fields","Fill in supplementary fields",{"$f":"IF(V193>W193,\"B cannot be higher than C\",IF(COUNTA(AA193:AB193)=0,\"Fill in supplementary fields\",(X193/2)*(V193/W193)+(X193/2)*(1/SUM(AA193:AB193))))+(IF(LEFT(T193,1)=\"1\",((W193+X193)/AC193)*(V193/(W193+X193))*AD193*AE193*(AC193/(1-AE193)),IF(LEFT(T193,1)=\"2\",IF(COUNTA(V193:X193)=0,\"Fill in supplementary fields\",(W193+X193)*AE193*AD193))))","v":{"$error":"#VALUE!"}},{"$f":"IF(V193>W193,\"B cannot be higher than C\",IFERROR(IF(COUNTA(AA193:AB193)=0,\"Fill in supplementary fields\",X193/2)*(V193/W193)+(X193/2)*(1/AA193),\"Fill in supplementary fields\"))+(IF(LEFT(T193,1)=\"1\",((W193+X193)/AC193)*(V193/(W193+X193))*AD193*AE193*(AC193/(1-AE193)),IF(LEFT(T193,1)=\"2\",IF(COUNTA(V193:X193)=0,\"Fill in supplementary fields\",(W193+X193)*AE193*AD193))))","v":{"$error":"#VALUE!"}},{"$f":"IF(V193>W193,\"B cannot be higher than C\",IFERROR(IF(COUNTA(AA193:AB193)=0,\"Fill in supplementary fields\",IF(AA193=0,X193/2*(V193/W193)+X193/2*(1/AB193),(X193/2)*(V193/W193))),\"Fill in supplementary fields\"))+(IF(LEFT(T193,1)=\"1\",((W193+X193)/AC193)*(V193/(W193+X193))*AD193*AE193*(AC193/(1-AE193)),IF(LEFT(T193,1)=\"2\",IF(COUNTA(V193:X193)=0,\"Fill in supplementary fields\",(W193+X193)*AE193*AD193))))","v":{"$error":"#VALUE!"}},"Enter exposure values in fields A and B","Fill in supplementary fields","Fill in supplementary fields","Fill in supplementary fields","Fill in supplementary fields",0,0,0,0,0,0,0]
[null,null,null,null,null,null,null,null,null,null,null,null,null,null,null,null,null,null,"",null,null,null,null,null,null,"",null,null,null,null,null,null,null,null,null,null,null,"",190,"Fill in supplementary fields","Fill in supplementary fields",{"$error":"#VALUE!"},{"$error":"#VALUE!"},{"$error":"#VALUE!"},"Enter exposure values in fields A and B","Fill in supplementary fields","Fill in supplementary fields","Fill in supplementary fields","Fill in supplementary fields",0,0,0,0,0,0,0]
[null,null,null,null,null,null,null,null,null,null,null,null,null,null,null,null,null,null,"",null,null,null,null,null,null,"",null,null,null,null,null,null,null,null,null,null,null,"",191,"Fill in supplementary fields","Fill in supplementary fields",{"$f":"IF(V195>W195,\"B cannot be higher than C\",IF(COUNTA(AA195:AB195)=0,\"Fill in supplementary fields\",(X195/2)*(V195/W195)+(X195/2)*(1/SUM(AA195:AB195))))+(IF(LEFT(T195,1)=\"1\",((V207*AD207)*(AE207/(1-AE207))),IF(LEFT(T195,1)=\"2\",IF(COUNTA(V195:X195)=0,\"Fill in supplementary fields\",(W195+X195)*AE195*AD195))))","v":{"$error":"#VALUE!"}},{"$f":"IF(V195>W195,\"B cannot be higher than C\",IFERROR(IF(COUNTA(AA195:AB195)=0,\"Fill in supplementary fields\",X195/2)*(V195/W195)+(X195/2)*(1/AA195),\"Fill in supplementary fields\"))+(IF(LEFT(T195,1)=\"1\",((V207*AD207)*(AE207/(1-AE207))),IF(LEFT(T195,1)=\"2\",IF(COUNTA(V195:X195)=0,\"Fill in supplementary fields\",(W195+X195)*AE195*AD195))))","v":{"$error":"#VALUE!"}},{"$f":"IF(V195>W195,\"B cannot be higher than C\",IFERROR(IF(COUNTA(AA195:AB195)=0,\"Fill in supplementary fields\",IF(AA195=0,X195/2*(V195/W195)+X195/2*(1/AB195),(X195/2)*(V195/W195))),\"Fill in supplementary fields\"))+(IF(LEFT(T195,1)=\"1\",((V207*AD207)*(AE207/(1-AE207))),IF(LEFT(T195,1)=\"2\",IF(COUNTA(V195:X195)=0,\"Fill in supplementary fields\",(W195+X195)*AE195*AD195))))","v":{"$error":"#VALUE!"}},"Enter exposure values in fields A and B","Fill in supplementary fields","Fill in supplementary fields","Fill in supplementary fields","Fill in supplementary fields",0,0,0,0,0,0,0]
[null,null,null,null,null,null,null,null,null,null,null,null,null,null,null,null,null,null,"",null,null,null,null,null,null,"",null,null,null,null,null,null,null,null,null,null,null,"",192,"Fill in supplementary fields","Fill in supplementary fields",{"$f":"IF(V196>W196,\"B cannot be higher than C\",IF(COUNTA(AA196:AB196)=0,\"Fill in supplementary fields\",(X196/2)*(V196/W196)+(X196/2)*(1/SUM(AA196:AB196))))+(IF(LEFT(T196,1)=\"1\",((W196+X196)/AC196)*(V196/(W196+X196))*AD196*AE196*(AC196/(1-AE196)),IF(LEFT(T196,1)=\"2\",IF(COUNTA(V196:X196)=0,\"Fill in supplementary fields\",(W196+X196)*AE196*AD196))))","v":{"$error":"#VALUE!"}},{"$f":"IF(V196>W196,\"B cannot be higher than C\",IFERROR(IF(COUNTA(AA196:AB196)=0,\"Fill in supplementary fields\",X196/2)*(V196/W196)+(X196/2)*(1/AA196),\"Fill in supplementary fields\"))+(IF(LEFT(T196,1)=\"1\",((W196+X196)/AC196)*(V196/(W196+X196))*AD196*AE196*(AC196/(1-AE196)),IF(LEFT(T196,1)=\"2\",IF(COUNTA(V196:X196)=0,\"Fill in supplementary fields\",(W196+X196)*AE196*AD196))))","v":{"$error":"#VALUE!"}},{"$f":"IF(V196>W196,\"B cannot be higher than C\",IFERROR(IF(COUNTA(AA196:AB196)=0,\"Fill in supplementary fields\",IF(AA196=0,X196/2*(V196/W196)+X196/2*(1/AB196),(X196/2)*(V196/W196))),\"Fill in supplementary fields\"))+(IF(LEFT(T196,1)=\"1\",((W196+X196)/AC196)*(V196/(W196+X196))*AD196*AE196*(AC196/(1-AE196)),IF(LEFT(T196,1)=\"2\",IF(COUNTA(V196:X196)=0,\"Fill in supplementary fields\",(W196+X196)*AE196*AD196))))","v":{"$error":"#VALUE!"}},"Enter exposure values in fields A and B","Fill in supplementary fields","Fill in supplementary fields","Fill in supplementary fields","Fill in supplementary fields",0,0,0,0,0,0,0]
[null,null,null,null,null,null,null,null,null,null,null,null,null,null,null,null,null,null,"",null,null,null,null,null,null,"",null,null,null,null,null,null,null,null,null,null,null,"",193,"Fill in supplementary fields","Fill in supplementary fields",{"$error":"#VALUE!"},{"$error":"#VALUE!"},{"$error":"#VALUE!"},"Enter exposure values in fields A and B","Fill in supplementary fields","Fill in supplementary fields","Fill in supplementary fields","Fill in supplementary fields",0,0,0,0,0,0,0]
[null,null,null,null,null,null,null,null,null,null,null,null,null,null,null,null,null,null,"",null,null,null,null,null,null,{"$f":"IFERROR(IF(Q198=\"1=Syndicated loan, arranger\",\"1=Official institution\",IF(Q198=1,\"1=Official institution\",\"\")),\"\")","v":""},null,null,null,null,null,null,null,null,null,null,null,"",{"$f":"AM197+1","v":194},{"$f":"IF(V198>W198,\"B cannot be higher than C\",IF(COUNTA(V198:X198)=0,\"Fill in supplementary fields\",IFERROR(IF(VALUE(LEFT(Z198,1))=1,X198/2+(V198/W198)*(X198/2),IF(VALUE(LEFT(Z198,1))=2,\"impossible combination\",\"check not available\")),\"\")))","v":"Fill in supplementary fields"},{"$f":"IF(V198>W198,\"B cannot be higher than C\",IF(COUNTA(V198:X198)=0,\"Fill in supplementary fields\",IFERROR(IF(VALUE(LEFT(Z198,1))=1,(V198/W198)*(X198/2),IF(VALUE(LEFT(Z198,1))=2,(V198/W198)*(X198),\"check not available\")),\"\")))","v":"Fill in supplementary fields"},{"$f":"IF(V198>W198,\"B cannot be higher than C\",IF(COUNTA(AA198:AB198)=0,\"Fill in supplementary fields\",(X198/2)*(V198/W198)+(X198/2)*(1/SUM(AA198:AB198))))+(IF(LEFT(T198,1)=\"1\",((V210*AD210)*(AE210/(1-AE210))),IF(LEFT(T198,1)=\"2\",IF(COUNTA(V198:X198)=0,\"Fill in supplementary fields\",(W198+X198)*AE198*AD198))))","v":{"$error":"#VALUE!"}},{"$f":"IF(V198>W198,\"B cannot be higher than C\",IFERROR(IF(COUNTA(AA198:AB198)=0,\"Fill in supplementary fields\",X198/2)*(V198/W198)+(X198/2)*(1/AA198),\"Fill in supplementary fields\"))+(IF(LEFT(T198,1)=\"1\",((V210*AD210)*(AE210/(1-AE210))),IF(LEFT(T198,1)=\"2\",IF(COUNTA(V198:X198)=0,\"Fill in supplementary fields\",(W198+X198)*AE198*AD198))))","v":{"$error":"#VALUE!"}},{"$f":"IF(V198>W198,\"B cannot be higher than C\",IFERROR(IF(COUNTA(AA198:AB198)=0,\"Fill in supplementary fields\",IF(AA198=0,X198/2*(V198/W198)+X198/2*(1/AB198),(X198/2)*(V198/W198))),\"Fill in supplementary fields\"))+(IF(LEFT(T198,1)=\"1\",((V210*AD210)*(AE210/(1-AE210))),IF(LEFT(T198,1)=\"2\",IF(COUNTA(V198:X198)=0,\"Fill in supplementary fields\",(W198+X198)*AE198*AD198))))","v":{"$error":"#VALUE!"}},{"$f":"IF(V198>W198,\"B cannot be higher than C\",IF(COUNTA(V198:X198)=0,\"Enter exposure values in fields A and B\",(X198)*(V198/W198)))","v":"Enter exposure values in fields A and B"},{"$f":"IF(V198>W198,\"B cannot be higher than C\",IFERROR(IF(COUNTA(AA198:AB198)=0,\"Fill in supplementary fields\",X198/2)*(V198/W198)+(X198/2)*(1/AA198),\"Fill in supplementary fields\"))","v":"Fill in supplementary fields"},{"$f":"IF(V198>W198,\"B cannot be higher than C\",IFERROR(IF(COUNTA(AA198:AB198)=0,\"Fill in supplementary fields\",IF(AA198=0,X198/2*(V198/W198)+X198/2*(1/AB198),(X198/2)*(V198/W198))),\"Fill in supplementary fields\"))","v":"Fill in supplementary fields"},{"$f":"IF(V198>W198,\"B cannot be higher than C\",IF(COUNTA(V198:X198)=0,\"Fill in supplementary fields\",(V198/W198)*((X198)+AD198*AE198)))","v":"Fill in supplementary fields"},{"$f":"IF(V198>W198,\"B cannot be higher than C\",IF(COUNTA(V198:X198)=0,\"Fill in supplementary fields\",(X198)*(V198/W198)))","v":"Fill in supplementary fields"},{"$f":"$X198","v":0},0,0,0,0,0,0]
[null,null,null,null,null,null,null,null,null,null,null,null,null,null,null,null,null,null,"",null,null,null,null,null,null,"",null,null,null,null,null,null,null,null,null,null,null,"",195,"Fill in supplementary fields","Fill in supplementary fields",{"$f":"IF(V199>W199,\"B cannot be higher than C\",IF(COUNTA(AA199:AB199)=0,\"Fill in supplementary fields\",(X199/2)*(V199/W199)+(X199/2)*(1/SUM(AA199:AB199))))+(IF(LEFT(T199,1)=\"1\",((W199+X199)/AC199)*(V199/(W199+X199))*AD199*AE199*(AC199/(1-AE199)),IF(LEFT(T199,1)=\"2\",IF(COUNTA(V199:X199)=0,\"Fill in supplementary fields\",(W199+X199)*AE199*AD199))))","v":{"$error":"#VALUE!"}},{"$f":"IF(V199>W199,\"B cannot be higher than C\",IFERROR(IF(COUNTA(AA199:AB199)=0,\"Fill in supplementary fields\",X199/2)*(V199/W199)+(X199/2)*(1/AA199),\"Fill in supplementary fields\"))+(IF(LEFT(T199,1)=\"1\",((W199+X199)/AC199)*(V199/(W199+X199))*AD199*AE199*(AC199/(1-AE199)),IF(LEFT(T199,1)=\"2\",IF(COUNTA(V199:X199)=0,\"Fill in supplementary fields\",(W199+X199)*AE199*AD199))))","v":{"$error":"#VALUE!"}},{"$f":"IF(V199>W199,\"B cannot be higher than C\",IFERROR(IF(COUNTA(AA199:AB199)=0,\"Fill in supplementary fields\",IF(AA199=0,X199/2*(V199/W199)+X199/2*(1/AB199),(X199/2)*(V199/W199))),\"Fill in supplementary fields\"))+(IF(LEFT(T199,1)=\"1\",((W199+X199)/AC199)*(V199/(W199+X199))*AD199*AE199*(AC199/(1-AE199)),IF(LEFT(T199,1)=\"2\",IF(COUNTA(V199:X199)=0,\"Fill in supplementary fields\",(W199+X199)*AE199*AD199))))","v":{"$error":"#VALUE!"}},"Enter exposure values in fields A and B","Fill in supplementary fields","Fill in supplementary fields","Fill in supplementary fields","Fill in supplementary fields",0,0,0,0,0,0,0]
[null,null,null,null,null,null,null,null,null,null,null,null,null,null,null,null,null,null,"",null,null,null,null,null,null,"",null,null,null,null,null,null,null,null,null,null,null,"",196,"Fill in supplementary fields","Fill in supplementary fields",{"$error":"#VALUE!"},{"$error":"#VALUE!"},{"$error":"#VALUE!"},"Enter exposure values in fields A and B","Fill in supplementary fields","Fill in supplementary fields","Fill in supplementary fields","Fill in supplementary fields",0,0,0,0,0,0,0]
[null,null,null,null,null,null,null,null,null,null,null,null,null,null,null,null,null,null,null,null,null,null,null,null,null,null,null,null,null,null,null,null,null,null,null,null,null,""]

{"sheet":"List of codes","index":3,"n_rows":3,"n_cols":3,"rows_kept":3,"cut":false,"hidden":false,"merged":[]}
[]
[]
[null,null,"CLICK HERE FOR A LIST OF CODES AND CLASSIFICATIONS"]

{"sheet":"MOB_validation","index":4,"n_rows":17,"n_cols":6,"rows_kept":17,"cut":false,"hidden":true,"merged":[]}
["Leveraging mechanism and role/position","Origin of the funds mobilised","Project finance SPV flag \n(1=Yes)","Type of arranger","Methodology applied for calculation in field 23","Type of mobilisation\n(for data PILOTS only)"]
["1=Syndicated loan, arranger","1=Provider country",1,"1=Official institution","1=OECD","1 = Second-level flows mobilised through CIVs, equity funds "]
["2=Syndicated loan, participant","2=Recipient country ",null,"2=Private institution","2=MDB-direct mobilisation","2 = Second-level flows mobilised through CIVs, debt funds "]
["3=Common shares in flat collective investment vehicle","3=Third high income/OECD country",null,null,"3=MDB-indirect mobilisation","3= Portfolio mobilisation"]
["4=Shares in the riskiest tranche of structured collective investment vehicle, first-loss shares and others (e.g. lock-up shares)","4=Other third country",null,null,null,"4= Generation"]
["5=Shares in the mezzanine/senior tranche of structured CIV","5=Other/multiple origins "]
["6=Guarantee/insurance "]
["7=Direct investment in companies/SPVs, equity"]
["8=Direct investment in companies/SPVs, mezzanine/senior debt"]
["9=Credit lines"]
["10=Simple co-financing arrangements"]
["11=Portfolio mobilisation, Investment exits (debt or equity) (PILOT) "]
["12=Porfolio mobilisation, Risk transfer through securitisation (PILOT)"]
["13=Porfolio mobilisation, Risk transfer through portfolio insurance (PILOT)"]
["14=Generation, equity (PILOT) "]
["15=Generation, hybrid capital (PILOT)"]
["16=Generation, bond issuance (PILOT)"]

{"sheet":"TOSSD_or_other_codelist","index":5,"n_rows":45,"n_cols":3,"rows_kept":45,"cut":false,"hidden":true,"merged":[[44,0,44,2]]}
["code","name","Description"]
["FA01","BLENDED FINANCE","The strategic use of development finance for the mobilisation of additional finance towards sustainable development."]
["FA02","ISLAMIC FINANCE","Sharia-compliant finance (the Islamic finance instruments are included in the financial instruments classification in the relevant categories)."]
["FA03","CO-FINANCING ARRANGEMENTS INVOLVING RECIPIENT COUNTERPART FUNDS","The co-financing by the recipient country public institutions."]
["FA04","OFFICIALLY-SUPPORTED EXPORT CREDITS","Credits extended by government-owned or controlled specialised export-financing agencies or institutions (ECAs) for commercial purposes to finance a specific purchase of goods or services from within the creditor country. They include both official direct export credits (i.e. loans extended by ECAs to facilitate exports to developing countries) and officially-guaranteed/insured export credits (i.e. loans extended by the private sector, but guaranteed/insured by ECAs to finance an export transaction)."]
["FA05","SDR TRANSACTIONS","Transactions denominated in Special Drawing Rights (SDRs)"]
[]
[]
[]
["code","name","Description"]
["FC01","SOUTH-SOUTH CO-OPERATION","A broad framework of collaboration among countries of the South in the political, economic, social, cultural, environmental and technical domains. Involving two or more TOSSD-eligible countries, it can take place on a bilateral, regional, intraregional or interregional basis. TOSSD-eligible countries share knowledge, skills, expertise and resources to meet their development goals through concerted efforts."]
["FC02","TRIANGULAR CO-OPERATION","A multi-country partnership involving partners with the following roles:\no The beneficiary partner that requests support to tackle a specific development challenge.\no The pivotal partner that has proven experience in tackling the issue, and shares its resources, knowledge and expertise to help others do the same. \no The facilitating partner that helps connect the partners, supporting the collaboration financially and technically."]
["FC03","MULTILATERAL SUPPORT FOR SOUTH-SOUTH CO-OPERATION","Collaborative arrangement whereby a multilateral institution supports South-South co-operation exchanges, providing a mechanism or a structure (financial or non-financial) that facilitates the exchange of knowledge, skills, expertise and/or resources among two or more developing countries."]
[]
[]
[]
[]
["code","name","Description"]
[1,"Pillar I","Cross border resources extended to TOSSD-eligible countries in support of sustainable development."]
[2,"Pillar II","Regional and global expenditures (that do not involve cross border flows to TOSSD eligible countries) to support the provision of international public goods, promote development enablers and address global challenges."]
[21,"Pillar 2.A","Regional and global expenditures: Issues specific to developing countries or their populations"]
[22,"Pillar 2.B","Regional and global expenditures: Issues of global nature"]
[]
[]
[]
["code","name","Description"]
[0,"Non-concessional loan","Does not convey a grant element of at least 35%, currently calculated at a uniform rate of discount of 5% (IMF and WB definition of concessionality)."]
[1,"Concessional loan","Conveys a grant element of at least 35%, currently calculated at a uniform rate of discount of 5% (IMF and WB definition of concessionality)."]
[2,"(For SSC providers only) Interest-free loan","Loans to a partner without interest charges."]
[]
[]
[]
[]
[]
[]
[]
[]
[]
[]
[]
[]
[]
["FORMULA TO GENERATE TOSSD PILLAR:"]
[]
["#  =IFERROR(IF(LEN($G5)>0,IF(OR($R5=\"B02\",$R5=\"E02\",$R5=\"G01\",$R5=\"H00\",$R5=\"I01\"),2,IF(OR($R5=\"A00\",$R5=\"E01\",$R5=\"F01\",$Q5=510,$Q5=520),1,IF(VLOOKUP($G5,recipient_country!AB:AD,3,FALSE)=\"Part I unallocated by income\",\"Formula cannot identify, please fill\",1))),\"Please fill other columns to generate pillar or manually fill\"),\"Formula cannot identify, please fill\")"]

{"sheet":"type_of_finance","index":6,"n_rows":46,"n_cols":6,"rows_kept":46,"cut":false,"hidden":true,"merged":[]}
["Finance_T","NameE","NameF","DetailsE","DetailsF"]
[110,"Standard grant","Dons ordinaires","Grants are transfers in cash or in kind for which no legal debt is incurred by the recipient.","Transferts en espèces ou en nature qui n'entraînent pas d'obligation juridique de remboursement pour le bénéficiaire."]
[210,"Interest subsidy","Bonification d'intérêt","A payment to soften the terms of private export credits, or loans or credits by the banking sector.","Subventions visant à assouplir les conditions des crédits à l’exportation ou des prêts/crédits du secteur bancaire."]
[310,"Capital subscription on deposit basis","Souscriptions au capital sur la base des dépôt","Payments to multilateral agencies in the form of notes and similar instruments, unconditionally encashable at sight by the recipient institutions.","Versements aux agences multilatérales sous forme de billets à ordre et effets similaires encaissables à vue sans condition par l'institution bénéficiaire."]
[311,"Capital subscription on encashment basis","Souscriptions au capital sur la base des encaissements ","Payments to multilateral agencies in the form of notes and similar instruments, unconditionally encashable at sight by the recipient institutions.","Versements aux agences multilatérales sous forme de billets à ordre et effets similaires encaissables à vue sans condition par l'institution bénéficiaire."]
[421,"Standard loan","Prêt ordinaire","Transfers in cash or in kind for which the recipient incurs legal debt (and the resulting claim is not intended to be traded).  Since payment obligations on standard loan are senior obligations, i.e. creditors are entitled to receive payments against their claims before anyone else, they are also referred to as senior loans.","Transferts en espèce ou en nature qui entraînent une obligation juridique de remboursement pour le bénéficiaire (dont la créance n'est pas échangeable.) Lorsque les obligations de remboursement sur les prêts ordinaires sont senior, càd que le créditeur est éligible à percevoir le remboursement de sa créance avant quiconque, on parle de prêt senior."]
[422,"Reimbursable grant ","Don remboursable","A contribution provided to a recipient institution for investment purposes, with the expectation of long-term reflows at conditions specified in the financing agreement. The provider assumes the risk of total or partial failure of the investment; it can also decide if and when to reclaim its investment.  ","Contribution fournie à une institution bénéficiaire à des fins d'investissement, dans une perspective de remboursement à long-terme à des conditions spécifiées dans l'accord de financement. Le fournisseur assume le risque partiel ou total de faillite de l'investissement ; il peut aussi décider si et quand il récupère son investissement."]
[423,"Bonds","Obligations","Fixed-interest debt instruments, issued by governments, public utilities, banks or companies, tradable in financial markets.","Instruments de dette à intérêts fixes émis par des gouvernements, entités publiques, banques ou sociétés, échangeables sur les marchés financiers."]
[424,"Asset-backed securities ","Titres adossés à des actifs","Securities whose value and income payments are derived from and backed by a specific pool of underlying assets.","Actifs dont la valeur et les revenus sont dérivés de et adossés à un panier d'actifs sous-jacents."]
[425,"Other debt securities","Autres actifs de dette","NULL","NULL"]
[431,"Subordinated loan ","Prêt subordonné","A loan that, in the event of default, will only be repaid after all senior obligations have been satisfied.  In compensation for the increased risk, mezzanine debt holders require a higher return for their investment than secured or more senior lenders.","Prêt qui, en cas de défaut, ne sera remboursé qu'après que les obligations senior soient satisfaites.  En compensation du risque accru, les détenteurs de dette mezzanine exigent un retour sur investissement plus élevé que les prêteurs garantis ou senior."]
[432,"Preferred equity ","Action privilégiée","Equity that, in the event of default, will be repaid after all senior obligations and subordinated loans have been satisfied; and will be paid before common equity holders. It is a more expensive source of finance than senior debt, a less expensive source than equity.","Action qui, en cas de défaut, ne sera remboursé qu'après que les obligations senior soient satisfaites ; mais avant les détenteurs d'actions ordinaires.  Il s'agit d'une source de financement plus onéreuse que la dette senior mais moins coûteuse que les actions."]
[433,"Other hybrid instruments ","Autres instruments hybrides","Including convertible debt or equity.","Incluant les dettes convertibles et les actions."]
[510,"Common equity","Action ordinaire","A share in the ownership of a corporation that gives the owner claims on the residual value of the corporation after creditors’ claims have been met.","Part de propriété dans une société donnant à son détenteur une créance sur la valeurs résiduelle de la société une fois que les créances de ses créditeurs ont été satisfaites."]
[520,"Shares in collective investment vehicles ","Parts dans des organismes collectifs d'investissement","Collective undertakings through which investors pool funds for investment in financial or nonfinancial assets or both. These vehicles issue shares (if a corporate structure is used) or units (if a trust structure is used).","Placement collectif par lequel un groupe d'investisseurs abonde un fond d'actifs financiers ou non financiers ou les deux. Ces véhicules émettent des parts (en cas de structure d'entreprise) ou des unités de compte (en cas de structure fiduciaire.)"]
[530,"Reinvested earnings","Bénéfices réinvestis","This item is only applicable to Foreign Direct Investment (FDI). Reinvested earnings on FDI consist of the retained earnings of a direct foreign investment enterprise which are treated as if they were distributed and remitted to foreign direct investors in proportion to their ownership of the equity of the enterprise and then reinvested by them in the enterprise. ","Cet item n'est applicable qu'aux investissement direct étrangers (IDE). Les bénéfices réinvestis sur des IDE consistent en des bénéfices retenus d'un investissement direct à l'étranger qui sont traités comme s'ils étaient redistribués et versés aux investisseurs en proportion de leur part dans l'actionnariat puis réinvestis par eux dans l'entreprise."]
[610,"Debt forgiveness:  ODA claims (P)","Annulation/conversion de la dette : créance APD (P)","NULL","NULL"]
[611,"Debt forgiveness: ODA claims (I)","Annulation/conversion de la dette : créance APD (I)","NULL","NULL"]
[612,"Debt forgiveness: OOF claims (P)","Annulation/conversion de la dette : créance AASP (P)","NULL","NULL"]
[613,"Debt forgiveness: OOF claims (I)","Annulation/conversion de la dette : créance AASP (I)","NULL","NULL"]
[614,"Debt forgiveness:  Private claims (P)","Annulation/conversion de la dette : créance du secteur privé (P)","NULL","NULL"]
[615,"Debt forgiveness:  Private claims (I)","Annulation/conversion de la dette : créance du secteur privé (I)","NULL","NULL"]
[616,"Debt forgiveness: OOF claims (DSR)","Annulation/conversion de la dette : créance AASP (DSR)","NULL","NULL"]
[617,"Debt forgiveness:  Private claims (DSR)","Annulation/conversion de la dette : créance du secteur privé (DSR)","NULL","NULL"]
[618,"Debt forgiveness: Other","Annulation/conversion de la dette : autre","NULL","NULL"]
[620,"Debt rescheduling: ODA claims (P)","Rééchelonnement de la dette : créance APD (P)","NULL","NULL"]
[621,"Debt rescheduling: ODA claims (I)","Rééchelonnement de la dette : créance APD (I)","NULL","NULL"]
[622,"Debt rescheduling: OOF claims (P)","Rééchelonnement de la dette : créance AASP (P)","NULL","NULL"]
[623,"Debt rescheduling: OOF claims (I)","Rééchelonnement de la dette : créance AASP (I)","NULL","NULL"]
[624,"Debt rescheduling:  Private claims (P)","Rééchelonnement de la dette : créance du secteur privé (P)","NULL","NULL"]
[625,"Debt rescheduling:  Private claims (I)","Rééchelonnement de la dette : créance du secteur privé (I)","NULL","NULL"]
[626,"Debt rescheduling: OOF claims (DSR)","Rééchelonnement de la dette : créance AASP (RSD)","NULL","NULL"]
[627,"Debt rescheduling:  Private claims (DSR)","Rééchelonnement de la dette : créance du secteur privé (RSD)","NULL","NULL"]
[630,"Debt rescheduling: OOF claim (DSR – original loan principal) ","Rééchelonnement de la dette : créance AASP (RSD – principal du prêt d’origine)","NULL","NULL"]
[631,"Debt rescheduling: OOF claim (DSR – original loan interest)","Rééchelonnement de la dette : créance AASP (RSD – intérêts du prêt d’origine)","NULL","NULL"]
[632,"Debt rescheduling: Private claim (DSR – original loan principal)","Rééchelonnement de la dette : créance du secteur privé (RSD – principal du prêt d’origine)","NULL","NULL"]
[633,"Debt forgiveness/conversion: export credit claims (P)","Annulation/conversion de la dette : créance de crédit à l'exportation (P)","NULL","NULL"]
[634,"Debt forgiveness/conversion:  export credit claims (I)","Annulation/conversion de la dette : créance de crédit à l'exportation (I)","NULL","NULL"]
[635,"Debt forgiveness:  export credit claims (DSR)","Annulation de la dette : créance de crédit à l'exportation (DSR)","NULL","NULL"]
[636,"Debt rescheduling:  export credit claims (P)","Rééchelonnement de la dette : créance de crédit à  l'exportation (P)","NULL","NULL"]
[637,"Debt rescheduling:  export credit claims (I)","Rééchelonnement de la dette : créance de crédit à  l'exportation (I)","NULL","NULL"]
[638,"Debt rescheduling:  export credit claims (DSR)","Rééchelonnement de la dette : créance de crédit à  l'exportation (DSR)","NULL","NULL"]
[639,"Debt rescheduling:  export credit claim (DSR – original loan principal)","Rééchelonnement de la dette : créance de crédit à  l'exportation (DSR - principal du prêt originel)","NULL","NULL"]
[1100,"Guarantees/insurance ","Garanties/assurances","NULL","NULL"]
[2100,"Direct provider spending",null,null,null,"TOSSD specific code "]
[3100,"Subsidies and similar transfers",null,null,null,"TOSSD specific code "]

{"sheet":"channel_codes","index":7,"n_rows":448,"n_cols":23,"rows_kept":448,"cut":false,"hidden":true,"merged":[]}
["code","AcronymE","code_name_e","Acronymf","code_name_f","ParentCode","Modality",null,"TOSSD","code","Acronym e","code name e","Acronym f","code name f","Parent code","pillar",null,null,"Script for CRS list "]
[10000," ","Public Sector Institutions"," ","Institutions du secteur public",10000,"NULL",null,null,10000," ","PUBLIC SECTOR INSTITUTIONS"," ","PUBLIC SECTOR INSTITUTIONS",10000,null,null,null,"(I miss the generic codes !?!)"]
[11000," ","Donor Government"," ","Gouvernement du donneur",10000,"NULL",null,null,11000," ","Donor Government"," ","Donor Government",10000]
[11001,"NULL","Central Government (donor govt.)","NULL","Gouvernment central (gouv. du donneur)",11000,"NULL",null,null,11001," ","Central Government"," ","Central Government",11000,null,null,null,"SELECT "]
[11002,"NULL","Local Government (donor govt.)","NULL","Gouvernment local (gouv. du donneur)",11000,"NULL",null,null,11002," ","Local Government"," ","Local Government",11000,null,null,null,"--* ,","AcronymE ,","Name as code_name_e,","Acronymf,","nom as code_name_f,"]
[11003,"NULL","Public corporations (donor govt.)","NULL","Entreprise publique (gouv. du donneur)",11000,"NULL",null,null,11003," ","Public corporations"," ","Public corporations",11000,null,null,null,"LC.ChannelCode as code, "]
[11004,"NULL","Other public entities in donor country","NULL","Autres entité publique dans le pays donneur",11000,"NULL",null,null,11004," ","Other public entities in donor country"," ","Other public entities in donor country",11000,null,null,null,"CG.GroupID as ParentCode, "]
[12000," ","Recipient Government"," ","Gouvernement du bénéficiaire",10000,"NULL",null,null,12000," ","Recipient Government"," ","Recipient Government",10000,null,null,null,"Modality"]
[12001,"NULL","Central Government (recipient govt.)","NULL","Gouvernment central (gouv. du bénéficiaire)",12000,"NULL",null,null,12001," ","Central Government"," ","Central Government",12000,null,null,null,"FROM "]
[12002,"NULL","Local Government (recipient govt.)","NULL","Gouvernment local (gouv. du bénéficiaire)",12000,"NULL",null,null,12002," ","Local Government"," ","Local Government",12000,null,null,null,"DCD_Prod.[DCD].[LookupChannel] LC"]
[12003,"NULL","Public corporations (recipient govt.)","NULL","Entreprise publique (gouv. du bénéficiaire)",12000,"NULL",null,null,12003," ","Public corporations"," ","Public corporations",12000,null,null,null,"INNER JOIN DCD_Prod.[DCD].[ChannelGroup] CG "]
[12004,"NULL","Other public entities in recipient country","NULL","Autres entité publique dans le pays bénéficiaire",12000,"NULL",null,null,12004," ","Other public entities in recipient country"," ","Other public entities in recipient country",12000,null,null,null,"on LC.ChannelCode = CG.ChannelCode "]
[13000," ","Third Country Government (Delegated co-operation)"," ","Gouvernement tiers (coopération déléguée)",10000,"NULL",null,null,13000," ","Third Country Government (Delegated co-operation)"," ","Third Country Government (Delegated co-operation)",10000,null,null,null,"WHERE "]
[20000," ","Non-Governmental Organisation (NGO) and Civil Society"," ","Organisations non gouvernementales (ONG) et société civile",20000,"NULL",null,null,20000," ","NON-GOVERNMENTAL ORGANISATIONS (NGOs) AND CIVIL SOCIETY "," ","NON-GOVERNMENTAL ORGANISATIONS (NGOs) AND CIVIL SOCIETY ",20000,null,null,null,"LC.Status not in (99) "]
[21000," ","International NGO"," ","ONG internationales",20000,"NULL",null,null,21000," ","International NGO"," ","International NGO",20000,null,null,null,"AND CG.Year = 2025 "]
[20146,"NULL","Undefined  Women’s Rights Organisation","NULL","Organisation de droits des femmes - Indéfini",20000,"pilot",null,null,21001,"AGID","Association of Geoscientists for International Development ","AGID","Association of Geoscientists for International Development ",21000,null,null,null,"ORDER BY "]
[21001,"AGID","Association of Geoscientists for International Development ","AGID","Association de géoscientifiques pour le développement international",21000,"B01",null,null,21005,"CUTS","Consumer Unity and Trust Society International ","CUTS","Consumer Unity and Trust Society International ",21000,null,null,null,"CG.GroupID, LC.ChannelCode"]
[21005,"CUTS","Consumer Unity and Trust Society International ","CUTS","Consumer Unity and Trust Society International",21000,"B01",null,null,21007,"ELCI","Environmental Liaison Centre International ","ELCI","Environmental Liaison Centre International ",21000]
[21007,"ELCI","Environmental Liaison Centre International ","CILE","Centre international de liaison pour l’environnement",21000,"B01",null,null,21011,"GCE","Global Campaign for Education ","GCE","Global Campaign for Education ",21000]
[21011,"GCE","Global Campaign for Education ","CME","Campagne mondiale pour l’éducation",21000,"B01",null,null,21013,"HAI","Health Action International ","HAI","Health Action International ",21000]
[21013,"HAI","Health Action International ","HAI","Health Action International ",21000,"B01",null,null,21016,"ICRC","International Committee of the Red Cross ","ICRC","International Committee of the Red Cross ",21000]
[21016,"ICRC","International Committee of the Red Cross ","CICR","Comité international de la Croix-Rouge ",21000,"B01",null,null,21018,"IFRCRCS","International Federation of Red Cross and Red Crescent Societies ","IFRCRCS","International Federation of Red Cross and Red Crescent Societies ",21000]
[21018,"IFRCRCS","International Federation of Red Cross and Red Crescent Societies ","FISCRCR","Fédération internationale des Sociétés de la Croix-Rouge et du Croissant-Rouge ",21000,"B01",null,null,21020," ","International HIV/AIDS Alliance "," ","International HIV/AIDS Alliance ",21000]
[21020,"NULL","International HIV/AIDS Alliance ","NULL","International HIV/AIDS Alliance",21000,"B01",null,null,21022,"INAFI","International Network for Alternative Financial Institutions ","INAFI","International Network for Alternative Financial Institutions ",21000]
[21022,"INAFI","International Network for Alternative Financial Institutions ","INAFI","Réseau international d’institutions financières",21000,"B01",null,null,21023,"IPPF","International Planned Parenthood Federation ","IPPF","International Planned Parenthood Federation ",21000]
[21023,"IPPF","International Planned Parenthood Federation ","IPPF","Fédération internationale pour le planning familial",21000,"B01",null,null,21024,"IPS","Inter Press Service, International Association ","IPS","Inter Press Service, International Association ",21000]
[21024,"IPS","Inter Press Service, International Association ","IPS","Inter Press Service, International Association",21000,"B01",null,null,21029,"MSF","Doctors Without Borders","MSF","Doctors Without Borders",21000]
[21029,"MSF","Doctors Without Borders","MSF","Médecins Sans Frontières",21000,"B01",null,null,21031,"PANOS","PANOS Institute ","PANOS","PANOS Institute ",21000]
[21031,"PANOS","PANOS Institute ","PANOS","Institut PANOS",21000,"B01",null,null,21032,"PSI","Population Services International ","PSI","Population Services International ",21000]
[21032,"PSI","Population Services International ","PSI","Organisation internationale pour les services en matière de population",21000,"B01",null,null,21034,"UNION","International Union Against Tuberculosis and Lung Disease ","UNION","International Union Against Tuberculosis and Lung Disease ",21000]
[21034,"UNION","International Union Against Tuberculosis and Lung Disease ","UNION","Union Internationale Contre la Tuberculose et les Maladies Respiratoires ",21000,"B01",null,null,21036,"WUS","World University Service ","WUS","World University Service ",21000]
[21036,"WUS","World University Service ","EUM","Entraide universitaire mondiale",21000,"B01",null,null,21038," ","International Alert"," ","International Alert",21000]
[21038,"NULL","International Alert","NULL","International Alert",21000,"B01",null,null,21041,"SID","Society for International Development","SID","Society for International Development",21000]
[21041,"SID","Society for International Development","SDI","Société pour le développement international",21000,"B01",null,null,21042,"Interpeace","International Peacebuilding Alliance","Interpeace","International Peacebuilding Alliance",21000]
[21042,"Interpeace","International Peacebuilding Alliance","Interpeace","Alliance internationale pour la consolidation de la paix",21000,"B01",null,null,21044,"ICCIDD","International Council for the Control of Iodine Deficiency Disorders","ICCIDD","International Council for the Control of Iodine Deficiency Disorders",21000]
[21044,"ICCIDD","International Council for the Control of Iodine Deficiency Disorders","ICCIDD","Conseil international pour la lutte contre les troubles dus à une carence en iode",21000,"B01",null,null,21045,"AMREF","African Medical and Research Foundation ","AMREF","African Medical and Research Foundation ",21000]
[21045,"AMREF","African Medical and Research Foundation ","AMREF","Fondation africaine pour la médecine et la recherche",21000,"B01",null,null,21046,"ACORD","Agency for Cooperation and Research in Development ","ACORD","Agency for Cooperation and Research in Development ",21000]
[21046,"ACORD","Agency for Cooperation and Research in Development ","ACORD","Association de Coopération et de Recherche pour le Développement",21000,"B01",null,null,21053," ","IPAS-Protecting Women’s Health, Advancing Women’s Reproductive Rights"," ","IPAS-Protecting Women’s Health, Advancing Women’s Reproductive Rights",21000]
[21053,"NULL","IPAS-Protecting Women’s Health, Advancing Women’s Reproductive Rights","NULL","IPAS-Protecting Women's Health, Advancing Women's Reproductive Rights",21000,"B01",null,null,21054,"LPI","Life and Peace Institute","LPI","Life and Peace Institute",21000]
[21054,"LPI","Life and Peace Institute","IVP","Institut Vie et Paix",21000,"B01",null,null,21057,"ICTJ","International Centre for Transitional Justice","ICTJ","International Centre for Transitional Justice",21000]
[21057,"ICTJ","International Centre for Transitional Justice","ICTJ","Centre International pour la Justice Transitionnelle",21000,"B01",null,null,21061,"IRCT","International Rehabilitation Council for Torture Victims","IRCT","International Rehabilitation Council for Torture Victims",21000]
[21061,"IRCT","International Rehabilitation Council for Torture Victims","IRCT","Conseil international de réhabilitation pour les victimes de torture",21000,"B01",null,null,21062,"TNC","The Nature Conservancy","TNC","The Nature Conservancy",21000]
[21062,"TNC","The Nature Conservancy","TNC","The Nature Conservancy",21000,"B01",null,null,21063,"CI","Conservation International","CI","Conservation International",21000]
[21063,"CI","Conservation International","NULL","Conservation International",21000,"B01",null,null,21064,"CHAI","Clinton Health Access Initiative, Inc.","CHAI","Clinton Health Access Initiative, Inc.",21000]
[21064,"CHAI","Clinton Health Access Initiative, Inc.","CHAI","Initiative Clinton pour l'accès à la santé",21000,"B01",null,null,21501,"OXFAM-I","OXFAM International","OXFAM-I","OXFAM International",21000]
[21146,"NULL","International Women’s Rights Organisation","NULL","Organisation internationale de droits des femmes",21000,"pilot",null,null,21502," ","World Vision"," ","World Vision",21000]
[21501,"OXFAM-I","OXFAM International","NULL","OXFAM International",21000,"B01",null,null,21503,"FHI360","Family Health International 360","FHI360","Family Health International 360",21000]
[21502,"NULL","World Vision","NULL","World Vision",21000,"B01",null,null,21504,"IRD","International Relief and Development","IRD","International Relief and Development",21000]
[21503,"FHI360","Family Health International 360","NULL","Family Health International 360",21000,"B01",null,null,21505," ","Save the Children"," ","Save the Children",21000]
[21504,"IRD","International Relief and Development","NULL","International Relief and Development",21000,"B01",null,null,21506,"IRC","International Rescue Committee","IRC","International Rescue Committee",21000]
[21505,"NULL","Save the Children","NULL","Save the Children",21000,"B01",null,null,21507,"PACT","Pact World","PACT","Pact World",21000]
[21506,"IRC","International Rescue Committee","NULL","International Rescue Committee",21000,"B01",null,null,21508,"SEforALL","Sustainable Energy for All","SEforALL","Sustainable Energy for All",21000]
[21507,"PACT","Pact World","NULL","Pact World",21000,"B01",null,null,21509,"AC","AmplifyChange","AC","AmplifyChange",21000]
[21508,"SEforALL","Sustainable Energy for All","SEforALL","Sustainable Energy for All",21000,"B01",null,null,47035,"ENDA","Environmental Development Action in the Third World ","ENDA","Environmental Development Action in the Third World ",21000]
[21509,"AC","AmplifyChange","AC","AmplifyChange",21000,"B01",null,null,22000," ","Provider country-based NGO"," ","Provider country-based NGO",20000]
[47035,"ENDA","Environmental Development Action in the Third World ","ENDA","Environnement et développement du Tiers-monde",21000,"B01",null,null,21006," ","Development Gateway Foundation "," ","Development Gateway Foundation ",22000]
[22000," ","Donor country-based NGO"," ","ONG basée dans un pays donneur",20000,"NULL",null,null,21008,"Eurostep","Eurostep ","Eurostep","Eurostep ",22000]
[21006,"NULL","Development Gateway Foundation ","NULL","Development Gateway Foundation",22000,"B01",null,null,21014,"HURIDOCS","Human Rights Information and Documentation Systems ","HURIDOCS","Human Rights Information and Documentation Systems ",22000]
[21008,"Eurostep","Eurostep ","Eurostep","Eurostep",22000,"B01",null,null,21015,"ICRA","International Catholic Rural Association ","ICRA","International Catholic Rural Association ",22000]
[21014,"HURIDOCS","Human Rights Information and Documentation Systems ","HURIDOCS","Systèmes d’Information et de Documentation sur les Droits de l’Homme",22000,"B01",null,null,21019,"IFS","International Federation of Settlements and Neighbourhood Centres ","IFS","International Federation of Settlements and Neighbourhood Centres ",22000]
[21015,"ICRA","International Catholic Rural Association ","ICRA","Association internationale rurale catholique",22000,"B01",null,null,21025,"ISC","International Seismological Centre ","ISC","International Seismological Centre ",22000]
[21019,"IFS","International Federation of Settlements and Neighbourhood Centres ","IFS","Fédération internationale des centres sociaux et communautaires",22000,"B01",null,null,21026,"ISHR","International Service for Human Rights ","ISHR","International Service for Human Rights ",22000]
[21025,"ISC","International Seismological Centre ","ISC","Centre séismologique international",22000,"B01",null,null,21027,"ITF","ITF Enhancing Human Security","ITF","ITF Enhancing Human Security",22000]
[21026,"ISHR","International Service for Human Rights ","ISHR","Service International pour les Droits de l’Homme",22000,"B01",null,null,21033,"TI","Transparency International ","TI","Transparency International ",22000]
[21027,"ITF","ITF Enhancing Human Security","ITF","ITF Améliorer la sécurité humaine",22000,"B01",null,null,21035,"OMCT","World Organisation Against Torture ","OMCT","World Organisation Against Torture ",22000]
[21033,"TI","Transparency International ","TI","Transparency International",22000,"B01",null,null,21037,"WWB","Women's World Banking","WWB","Women's World Banking",22000]
[21035,"OMCT","World Organisation Against Torture ","OMCT","Organisation mondiale contre la torture",22000,"B01",null,null,21040,"IWTC","International Women's Tribune Centre","IWTC","International Women's Tribune Centre",22000]
[21037,"WWB","Women's World Banking","WWB","Banque mondiale des femmes",22000,"B01",null,null,21047," ","AgriCord"," ","AgriCord",22000]
[21040,"IWTC","International Women's Tribune Centre","CTIF","Centre de la tribune internationale de la femme",22000,"B01",null,null,21049,"ECDPM","European Centre for Development Policy Management ","ECDPM","European Centre for Development Policy Management ",22000]
[21047,"NULL","AgriCord","NULL","AgriCord",22000,"B01",null,null,21050," ","Geneva Call"," ","Geneva Call",22000]
[21049,"ECDPM","European Centre for Development Policy Management ","ECDPM","Centre européen de gestion de politiques de développement",22000,"B01",null,null,21058,"ICG","International Crisis Group","ICG","International Crisis Group",22000]
[21050,"NULL","Geneva Call","NULL","Appel de Genève",22000,"B01",null,null,21060,"APT","Association for the Prevention of Torture","APT","Association for the Prevention of Torture",22000]
[21058,"ICG","International Crisis Group","ICG","International Crisis Group",22000,"B01",null,null,22501,"OXFAM","OXFAM - provider country office","OXFAM","OXFAM - provider country office",22000]
[21060,"APT","Association for the Prevention of Torture","APT","Association pour la prévention de la torture",22000,"B01",null,null,22502," ","Save the Children - donor country office"," ","Save the Children - donor country office",22000]
[22146,"NULL","National Women’s Rights Organisation","NULL","Organisation nationale de droits des femmes",22000,"pilot",null,null,47042,"FIT","Foundation for International Training ","FIT","Foundation for International Training ",22000]
[22501,"OXFAM","OXFAM - provider country office","NULL","OXFAM - provider country office",22000,"B01",null,null,23000," ","Developing country-based NGO"," ","Developing country-based NGO",20000]
[22502,"NULL","Save the Children - donor country office","NULL","Save the Children - donor country office",22000,"B01",null,null,21003,"CLASCO","Latin American Council for Social Sciences ","CLASCO","Latin American Council for Social Sciences ",23000]
[47042,"FIT","Foundation for International Training ","FIT","Fondation pour la formation internationale dans les pays du tiers monde",22000,"B01",null,null,21010,"FAWE","Forum for African Women Educationalists ","FAWE","Forum for African Women Educationalists ",23000]
[23000," ","Developing country-based NGO"," ","ONG basée dans un pays en développement",20000,"NULL",null,null,21028,"IUEF","International University Exchange Fund - IUEF Stip. in Africa and Latin America","IUEF","International University Exchange Fund - IUEF Stip. in Africa and Latin America",23000]
[21003,"CLASCO","Latin American Council for Social Sciences ","CLASCO","Conseil latino-américain des sciences sociales",23000,"B01",null,null,21030,"PAID","Pan African Institute for Development","PAID","Pan African Institute for Development",23000]
[21010,"FAWE","Forum for African Women Educationalists ","FAWE","Forum des éducatrices africaines",23000,"B01",null,null,21048,"AAU","Association of African Universities","AAU","Association of African Universities",23000]
[21028,"IUEF","International University Exchange Fund - IUEF Stip. in Africa and Latin America","FIEU","Fonds international d’échanges universitaires - Échanges intéressant l’Afrique et l’Amérique latine",23000,"B01",null,null,21051,"ISPEC","Institut Supérieur Panafricaine d’Economie Coopérative","ISPEC","Institut Supérieur Panafricaine d’Economie Coopérative",23000]
[21030,"PAID","Pan African Institute for Development","IPD","Institut panafricain pour le développement",23000,"B01",null,null,21055,"RATN","Regional AIDS Training Network","RATN","Regional AIDS Training Network",23000]
[21048,"AAU","Association of African Universities","AUA","Association des universités africaines",23000,"B01",null,null,21059,"ASF","Africa Solidarity Fund","ASF","Africa Solidarity Fund",23000]
[21051,"ISPEC","Institut Supérieur Panafricaine d’Economie Coopérative","ISPEC","Institut supérieur panafricaine d’economie coopérative",23000,"B01",null,null,23501," ","National Red Cross and Red Crescent Societies"," ","National Red Cross and Red Crescent Societies",23000]
[21055,"RATN","Regional AIDS Training Network","RRFS","Réseau régional de formation sur le SIDA",23000,"B01",null,null,30000," ","Public-Private Partnerships (PPP) and Networks"," ","Public-Private Partnerships (PPP) and Networks",30000]
[21059,"ASF","Africa Solidarity Fund","ASF","Fonds solidaire pour l'Afrique",23000,"B01",null,null,31000," ","Public-Private Partnerships (PPP)"," ","Public-Private Partnerships (PPP)",30000]
[23146,"NULL","Local Women’s Rights Organisation","NULL","Organisation locale de droits des femmes",23000,"pilot",null,null,21056,"REEEP","Renewable Energy and Energy Efficiency Partnership","REEEP","Renewable Energy and Energy Efficiency Partnership",31000]
[23501,"NULL","National Red Cross and Red Crescent Societies","NULL","Sociétés nationales de la Croix-Rouge et du Croissant-Rouge",23000,"B01",null,null,30001,"GAIN","Global Alliance for Improved Nutrition ","GAIN","Global Alliance for Improved Nutrition ",31000]
[21056,"REEEP","Renewable Energy and Energy Efficiency Partnership","REEEP","Partenariat pour les énergies renouvelables et l'efficience énergétique",31000,"B01",null,null,30003,"GeSCI","Global e-Schools and Communities Initiative ","GeSCI","Global e-Schools and Communities Initiative ",31000]
[30000," ","Public-Private Partnerships (PPP) and Networks"," ","Partenariats public-privé (PPP) et réseaux",30000,"NULL",null,null,30004,"GWP","Global Water Partnership ","GWP","Global Water Partnership ",31000]
[31000," ","Public-Private Partnerships (PPP)"," ","Partenariats public-privé (PPP)",30000,"NULL",null,null,30005,"IAVI","International AIDS Vaccine Initiative ","IAVI","International AIDS Vaccine Initiative ",31000]
[30001,"GAIN","Global Alliance for Improved Nutrition ","GAIN","Alliance mondiale pour une meilleure nutrition ",31000,"B01",null,null,30006,"IPM","International Partnership on Microbicides ","IPM","International Partnership on Microbicides ",31000]
[30003,"GeSCI","Global e-Schools and Communities Initiative ","GeSCI","Initiative mondiale en faveur de l’informatique dans les écoles et dans les communautés ",31000,"B01",null,null,30007,"GAID","Global Alliance for ICT and Development","GAID","Global Alliance for ICT and Development",31000]
[30004,"GWP","Global Water Partnership ","GWP","Partenariat mondial pour l'eau",31000,"B01",null,null,30008," ","Cities Alliance"," ","Cities Alliance",31000]
[30005,"IAVI","International AIDS Vaccine Initiative ","IAVI","Initiative internationale pour un vaccin contre le SIDA",31000,"B01",null,null,30009,"SAS","Small Arms Survey","SAS","Small Arms Survey",31000]
[30006,"IPM","International Partnership on Microbicides ","IPM","Partenariat international pour des microbicides ",31000,"B01",null,null,30011,"IUCN","International Union for the Conservation of Nature","IUCN","International Union for the Conservation of Nature",31000]
[30007,"GAID","Global Alliance for ICT and Development","GAID","Alliance mondiale pour les TIC et le développement",31000,"B01",null,null,30012,"GCPF","Global Climate Partnership Fund","GCPF","Global Climate Partnership Fund",31000]
[30008,"NULL","Cities Alliance","NULL","Alliance pour les villes",31000,"B01",null,null,30013,"MEF","Microfinance Enhancement Facility","MEF","Microfinance Enhancement Facility",31000]
[30009,"SAS","Small Arms Survey","SAS","Small Arms Survey",31000,"B01",null,null,30014,"REGMIFA","Regional Micro, Small and Medium Enterprise Investment Fund for Sub-Saharan Africa","REGMIFA","Regional Micro, Small and Medium Enterprise Investment Fund for Sub-Saharan Africa",31000]
[30011,"IUCN","International Union for the Conservation of Nature","UICN","Union internationale pour la conservation de la nature",31000,"B01",null,null,30015,"GEEREF","Global Energy Efficiency and Renewable Energy Fund","GEEREF","Global Energy Efficiency and Renewable Energy Fund",31000]
[30012,"GCPF","Global Climate Partnership Fund","GCPF","Global Climate Partnership Fund",31000,"B01",null,null,30016,"EFSE","European Fund for Southeast Europe","EFSE","European Fund for Southeast Europe",31000]
[30013,"MEF","Microfinance Enhancement Facility","MEF","Mécanisme de soutien au microfinancement",31000,"B01",null,null,30017,"SANAD","SANAD Fund for Micro, Small and Medium Enterprises","SANAD","SANAD Fund for Micro, Small and Medium Enterprises",31000]
[30014,"REGMIFA","Regional Micro, Small and Medium Enterprise Investment Fund for Sub-Saharan Africa","REGMIFA","Fonds régional d’investissement pour les très petites, petites et moyennes entreprises d’Afrique subsaharienne",31000,"B01",null,null,30018,"AFC","Africa Finance Corporation","AFC","Africa Finance Corporation",31000]
[30015,"GEEREF","Global Energy Efficiency and Renewable Energy Fund","GEEREF","Fonds mondial pour la promotion de l'efficacité énergétique et des énergies renouvelables",31000,"B01",null,null,30019,"TCX","Currency Exchange Fund N.V.","TCX","Currency Exchange Fund N.V.",31000]
[30016,"EFSE","European Fund for Southeast Europe","EFSE","European Fund for Southeast Europe",31000,"B01",null,null,30020,"GEEREF II","Global Energy Efficiency and Renewable Energy Fund II","GEEREF II","Global Energy Efficiency and Renewable Energy Fund II",31000]
[30017,"SANAD","SANAD Fund for Micro, Small and Medium Enterprises","SANAD","SANAD Fund for Micro, Small and Medium Enterprises",31000,"B01",null,null,31006,"CEPI","Coalition for Epidemic Preparedness Innovations","CEPI","Coalition for Epidemic Preparedness Innovations",31000]
[30018,"AFC","Africa Finance Corporation","AFC","Corporation Financière Africaine",31000,"B01",null,null,47043," ","Global Crop Diversity Trust "," ","Global Crop Diversity Trust ",31000]
[30019,"TCX","Currency Exchange Fund N.V.","TCX","Currency Exchange Fund N.V.",31000,"B01",null,null,32000," ","Networks"," ","Networks",30000]
[30020,"GEEREF II","Global Energy Efficiency and Renewable Energy Fund II","GEEREF II","Global Energy Efficiency and Renewable Energy Fund II",31000,"B01",null,null,21017,"ICTSD","International Centre for Trade and Sustainable Development ","ICTSD","International Centre for Trade and Sustainable Development ",32000]
[31006,"CEPI","Coalition for Epidemic Preparedness Innovations","CIPE","Coalition pour les innovations en matière de préparation aux épidémies",31000,"B01",null,null,21043,"AWEPA","European Parliamentarians for Africa","AWEPA","European Parliamentarians for Africa",32000]
[47043,"NULL","Global Crop Diversity Trust ","NULL","Global Crop Diversity Trust",31000,"B01",null,null,31001,"GDN","Global Development Network","GDN","Global Development Network",32000]
[32000," ","Networks"," ","Réseaux",30000,"NULL",null,null,31002,"GKP","Global Knowledge Partnership","GKP","Global Knowledge Partnership",32000]
[21043,"AWEPA","European Parliamentarians for Africa","AWEPA","Association des parlementaires d’Europe pour l’Afrique",32000,"B01",null,null,31003,"ILC","International Land Coalition","ILC","International Land Coalition",32000]
[31001,"GDN","Global Development Network","GDN","Réseau de développement mondial",32000,"B01",null,null,31004,"EITI","Extractive Industries Transparency Initiative International Secretariat","EITI","Extractive Industries Transparency Initiative International Secretariat",32000]
[31002,"GKP","Global Knowledge Partnership","GKP","Alliance mondiale pour le savoir ",32000,"B01",null,null,31005,"PNoWB","Parliamentary Network on the World Bank","PNoWB","Parliamentary Network on the World Bank",32000]
[31003,"ILC","International Land Coalition","ILC","Coalition internationale pour l'accès à la terre ",32000,"B01",null,null,31007,"DNDi","Drugs for Neglected Diseases initative","DNDi","Drugs for Neglected Diseases initative",32000]
[31004,"EITI","Extractive Industries Transparency Initiative International Secretariat","ITIE","Secrétariat de l'Initiative pour la transparence dans les industries extractives",32000,"B01",null,null,31008,"FIND","Foundation for Innovative New Diagnostics","FIND","Foundation for Innovative New Diagnostics",32000]
[31005,"PNoWB","Parliamentary Network on the World Bank","RPsBM","Réseau parlementaire sur la Banque mondaile",32000,"B01",null,null,47010,"CAPAM","Commonwealth Agency for Public Administration and Management ","CAPAM","Commonwealth Agency for Public Administration and Management ",32000]
[31007,"DNDi","Drugs for Neglected Diseases initative","DNDi","Initiative médicaments contres les maladies négligées",32000,"B01",null,null,47028,"CPTM","Commonwealth Partnership for Technical Management ","CPTM","Commonwealth Partnership for Technical Management ",32000]
[31008,"FIND","Foundation for Innovative New Diagnostics","FIND","Fondation pour les nouveaux diagnostics innovants",32000,"B01",null,null,40000," ","Multilateral Organisations"," ","Multilateral Organisations",40000]
[47010,"CAPAM","Commonwealth Agency for Public Administration and Management ","CAPAM","Agence du Commonwealth pour l'administration et la gestion publiques",32000,"B01",null,null,41000," ","United Nations (UN) agency, fund or commission"," ","United Nations (UN) agency, fund or commission",40000]
[47028,"CPTM","Commonwealth Partnership for Technical Management ","CPTM","Partenariat pour la gestion technique (Commonwealth)",32000,"B01",null,null,41100," ","UN entities (core contributions reportable in full)"," ","UN entities (core contributions reportable in full)",41000]
[40000," ","Multilateral Organisations"," ","Organisations multilatérales",40000,"NULL",null,null,21002,"AITIC","Agency for International Trade Information and Co-operation ","AITIC","Agency for International Trade Information and Co-operation ",47000]
[41000," ","United Nations (UN) agency, fund or commission"," ","Agence, fonds ou commission des Nations Unies (ONU)",40000,"NULL",null,null,30010,"UNITAID","International drug purchase facility","UNITAID","International drug purchase facility",41100]
[41100," ","UN entities (core contributions reportable in full)"," ","Entités des Nations Unies (contributions aux budgets reguliers à déclarer dans leur intégralité)",41000,"NULL",null,null,41101,"UNCCD","Convention to Combat Desertification ","UNCCD","Convention to Combat Desertification ",41100]
[30010,"UNITAID","International drug purchase facility","UNITAID","Facilité internationale d'achat de médicaments",41100,"B021",null,null,41102,"DLCO-EA","Desert Locust Control Organisation for Eastern Africa ","DLCO-EA","Desert Locust Control Organisation for Eastern Africa ",47000]
[41101,"UNCCD","Convention to Combat Desertification ","CCD ","Convention sur la lutte contre la désertification ",41100,"B021",null,null,41103,"ECA","Economic Commission for Africa ","ECA","Economic Commission for Africa ",41100]
[41103,"ECA","Economic Commission for Africa ","CEA","Commission économique pour l'Afrique",41100,"B021",null,null,41104,"ECLAC","Economic Commission for Latin America and the Caribbean","ECLAC","Economic Commission for Latin America and the Caribbean",41300]
[41107,"IAEA-TCF","International Atomic Energy Agency (Contributions to Technical Cooperation Fund Only)","AIEA-FTC","Agence internationale de l'énergie atomique (Contributions au Fonds de Coopération Technique uniquement)",41100,"B022",null,null,41105,"ESCWA","Economic and Social Commission for Western Asia","ESCWA","Economic and Social Commission for Western Asia",41300,21]
[41108,"IFAD","International Fund for Agricultural Development ","FIDA","Fonds international de développement agricole",41100,"B021",null,null,41106,"ESCAP","Economic and Social Commission for Asia and the Pacific ","ESCAP","Economic and Social Commission for Asia and the Pacific ",41300]
[41110,"UNAIDS","Joint United Nations Programme on HIV/AIDS ","ONUSIDA","Programme commun des Nations Unies sur le VIH/SIDA",41100,"B021",null,null,41107,"IAEA-TCF","International Atomic Energy Agency (Contributions to Technical Cooperation Fund Only)","IAEA-TCF","International Atomic Energy Agency (Contributions to Technical Cooperation Fund Only)",41100,21]
[41111,"UNCDF","United Nations Capital Development Fund ","FENU","Fonds d’équipement des Nations Unies ",41100,"B021",null,null,41108,"IFAD","International Fund for Agricultural Development ","IFAD","International Fund for Agricultural Development ",41100,21]
[41112,"UNCTAD","United Nations Conference on Trade and Development ","CNUCED","Conférence des Nations Unies sur le commerce et le développement",41100,"B021",null,null,41110,"UNAIDS","Joint United Nations Programme on HIV/AIDS ","UNAIDS","Joint United Nations Programme on HIV/AIDS ",41100,22]
[41114,"UNDP","United Nations Development Programme ","PNUD","Programme des Nations Unies pour le développement",41100,"B021",null,null,41111,"UNCDF","United Nations Capital Development Fund ","UNCDF","United Nations Capital Development Fund ",41100,21]
[41116,"UNEP","United Nations Environment Programme ","PNUE","Programme des Nations Unies pour l'environnement",41100,"B021",null,null,41112,"UNCTAD","United Nations Conference on Trade and Development ","UNCTAD","United Nations Conference on Trade and Development ",41100,21]
[41119,"UNFPA","United Nations Population Fund ","UNFPA","Fonds des Nations Unies pour la population",41100,"B021",null,null,41114,"UNDP","United Nations Development Programme ","UNDP","United Nations Development Programme ",41100,21]
[41120,"UN Habitat","United Nations Human Settlement Programme ","UN Habitat","Programme des Nations Unies pour les établissements humains",41100,"B021",null,null,41116,"UNEP","United Nations Environment Programme ","UNEP","United Nations Environment Programme ",41100,22]
[41121,"UNHCR","United Nations Office of the High Commissioner for Refugees","HCR","Haut Commissariat des Nations Unies pour les réfugiés",41100,"B021",null,null,41119,"UNFPA","United Nations Population Fund ","UNFPA","United Nations Population Fund ",41100,21]
[41122,"UNICEF","United Nations Children’s Fund ","UNICEF","Fonds des Nations Unies pour l'enfance",41100,"B021",null,null,41120,"UN Habitat","United Nations Human Settlement Programme ","UN Habitat","United Nations Human Settlement Programme ",41100]
[41123,"UNIDO","United Nations Industrial Development Organisation ","ONUDI","Organisation des Nations Unies pour le développement industriel",41100,"B021",null,null,41121,"UNHCR","United Nations Office of the High Commissioner for Refugees","UNHCR","United Nations Office of the High Commissioner for Refugees",41100,21]
[41125,"UNITAR","United Nations Institute for Training and Research ","UNITAR","Institut des Nations Unies pour la formation et la recherche ",41100,"B021",null,null,41122,"UNICEF","United Nations Children’s Fund ","UNICEF","United Nations Children’s Fund ",41100,21]
[41127,"UNOCHA","United Nations Office of Co-ordination of Humanitarian Affairs ","OCHA","Bureau des Nations Unies pour la coordination de l'assistance humanitaire",41100,"B021",null,null,41123,"UNIDO","United Nations Industrial Development Organisation ","UNIDO","United Nations Industrial Development Organisation ",41100,21]
[41129,"UNRISD","United Nations Research Institute for Social Development ","UNRISD","Institut de recherche des Nations Unies pour le développement social ",41100,"B021",null,null,41125,"UNITAR","United Nations Institute for Training and Research ","UNITAR","United Nations Institute for Training and Research ",41100]
[41130,"UNRWA","United Nations Relief and Works Agency for Palestine Refugees in the Near East","UNRWA","Office de secours et de travaux des Nations Unies pour les réfugiés de Palestine dans le Proche-Orient",41100,"B021",null,null,41126,"UNMAS","United Nations Mine Action Service ","UNMAS","United Nations Mine Action Service ",41600]
[41131,"UNSSC","United Nations System Staff College ","UNSSC","Ecole des cadres du système des Nations Unies",41100,"B021",null,null,41127,"UNOCHA","United Nations Office of Co-ordination of Humanitarian Affairs ","UNOCHA","United Nations Office of Co-ordination of Humanitarian Affairs ",41100]
[41134,"UNU","United Nations University (including Endowment Fund) ","UNU","Université des Nations Unies (y compris le Fonds de dotation)",41100,"B021",null,null,41128,"UNODC","United Nations Office on Drugs and Crime ","UNODC","United Nations Office on Drugs and Crime ",41300,22]
[41135,"UNV","United Nations Volunteers ","UNV","Programme des volontaires des Nations Unies ",41100,"B021",null,null,41129,"UNRISD","United Nations Research Institute for Social Development ","UNRISD","United Nations Research Institute for Social Development ",41100]
[41140,"WFP","World Food Programme ","PAM","Programme alimentaire mondial",41100,"B021",null,null,41130,"UNRWA","United Nations Relief and Works Agency for Palestine Refugees in the Near East","UNRWA","United Nations Relief and Works Agency for Palestine Refugees in the Near East",41100,21]
[41143,"WHO-CVCA","World Health Organisation - core voluntary contributions account","OMS-CVSOD","Organisation mondiale de la santé - compte de contributions volontaires sans objet désigné",41100,"B021",null,null,41131,"UNSSC","United Nations System Staff College ","UNSSC","United Nations System Staff College ",41100]
[41144,"ILO-RBSA","International Labour Organisation - Regular Budget Supplementary Account","OIT-CSBO","Organisation internationale du Travail - Compte supplémentaire du budget ordinaire",41100,"B021",null,null,41132,"UNSCN","United Nations System Standing Committee on Nutrition ","UNSCN","United Nations System Standing Committee on Nutrition ",41600]
[41145,"IMO-TCF","International Maritime Organization - Technical Co-operation Fund","OMI-PICT","Organisation maritime internationale - Programme intégré de coopération technique",41100,"B022",null,null,41133,"UNSIA","United Nations Special Initiative on Africa ","UNSIA","United Nations Special Initiative on Africa ",41600]
[41146,"UNWOMEN","United Nations Entity for Gender Equality and the Empowerment of Women","ONU Femmes","Entité des Nations Unies pour l'égalité des sexes et l'autonomisation de la femme",41100,"B021",null,null,41134,"UNU","United Nations University (including Endowment Fund) ","UNU","United Nations University (including Endowment Fund) ",41100]
[41149,"UNDCO","United Nations Development Coordination Office","UNDCO","Bureau de la coordination des activités de développement des Nations Unies",41100,"B021",null,null,41135,"UNV","United Nations Volunteers ","UNV","United Nations Volunteers ",41100]
[41320,"UN-TBLDC","Technology Bank for Least Developed Countries","UN-TBLDC","Banque de Technologies en faveur des Pays les Moins Avancés",41100,"B021",null,null,41136,"UNVFD","United Nations Voluntary Fund on Disability ","UNVFD","United Nations Voluntary Fund on Disability ",41600]
[45001,"WTO-ITC","World Trade Organisation - International Trade Centre ","OMC-CCI","Centre du commerce international de l'Organisation mondiale du commerce",41100,"B021",null,null,41137,"UNVFTC","United Nations Voluntary Fund for Technical Co-operation in the Field of Human Rights","UNVFTC","United Nations Voluntary Fund for Technical Co-operation in the Field of Human Rights",41600]
[45002,"WTO-ACWL","World Trade Organisation - Advisory Centre on WTO Law","OMC-CCLO","Centre consultatif sur la législation de l'Organisation mondiale du commerce",41100,"B021",null,null,41138,"UNVFVT","United Nations Voluntary Fund for Victims of Torture ","UNVFVT","United Nations Voluntary Fund for Victims of Torture ",41600]
[45003,"WTO-GTF","World Trade Organisation Global Trust Fund ","OMC-FGAS","Organisation mondiale du commerce - Fonds global d'affectation spéciale",41100,"B021",null,null,47153,"ACC","IFAD Core additional climate contributions","ACC","IFAD Core additional climate contributions",41100,21]
[47066,"IOM","International Organisation for Migration ","OIM","Organisation internationale des migrations ",41100,"B021",null,null,41200," ","UN entities (core contributions reportable in TOSSD only)"," ","UN entities (core contributions reportable in TOSSD only)",41000]
[47083,"PAHO","Pan-American Health Organisation ","OPS","Organisation panaméricaine de la santé",41100,"B021",null,null,41140,"WFP","World Food Programme ","WFP","World Food Programme ",41100,21]
[47153,"ACC","IFAD Core additional climate contributions","ACC","FIDA Contributions additionnelles de base pour le climat",41100,"B02",null,null,41141,"PBF","United Nations Peacebuilding Fund","PBF","United Nations Peacebuilding Fund",41400,21]
[41201,"CTBTO","Comprehensive Nuclear Test Ban Treaty Organization",null,"Organisation du traité d'interdiction complète des essais nucléaires",41200,"NULL",null,null,41142,"UNDEF","United Nations Democracy Fund","UNDEF","United Nations Democracy Fund",41600]
[41202,"ICAO","International Civil Aviation Organization","OACI","Organisation de l'aviation civile internationale",41200,"NULL",null,null,41143,"WHO-CVCA","World Health Organisation - core voluntary contributions account","WHO-CVCA","World Health Organisation - core voluntary contributions account",41100,22]
[41203,"ICC","International Criminal Court","CPI","Cour Pénale Internationale",41200,"NULL",null,null,41144,"ILO-RBSA","International Labour Organisation - Regular Budget Supplementary Account","ILO-RBSA","International Labour Organisation - Regular Budget Supplementary Account",41100,21]
[41204,"IRMCT","International Residual Mechanism for Criminal Tribunals",null,"Mécanisme international appelé à exercer les fonctions résiduelles des Tribunaux pénaux",41200,"NULL",null,null,41145,"IMO-TCF","International Maritime Organization - Technical Co-operation Fund","IMO-TCF","International Maritime Organization - Technical Co-operation Fund",41100,22]
[41205,"ISA","International Seabed Authority",null,"Autorité internationale des fonds marins",41200,"NULL",null,null,41146,"UNWOMEN","United Nations Entity for Gender Equality and the Empowerment of Women","UNWOMEN","United Nations Entity for Gender Equality and the Empowerment of Women",41100,22]
[41206,"ITLOS","International Tribunal for the Law of the Sea","TIDM","Tribunal international du droit de la mer",41200,"NULL",null,null,41147,"CERF","Central Emergency Response Fund","CERF","Central Emergency Response Fund",41400,21]
[41207,"OPCW","Organization for the Prohibition of Chemical Weapons","OIAC","Organisation pour l'interdiction des Armes Chimiques",41200,"NULL",null,null,41148,"UNDPPA-SZA","United Nations Department of Political and Peacebuilding Affairs, Trust Fund in Support of Political Affairs","UNDPPA-SZA","United Nations Department of Political and Peacebuilding Affairs, Trust Fund in Support of Political Affairs",41500]
[41208,"DESA","Department of Economic and Social Affairs","DAES","Département des affaires économiques et sociales",41200,"NULL",null,null,41149,"UNDCO","United Nations Development Coordination Office","UNDCO","United Nations Development Coordination Office",41100,22]
[41209,"DGACM","Department of General Assembly and Conference Management",null,"Département de l'Assemblée générale et de la gestion des conférences",41200,"NULL",null,null,41150,"UNIDIR","United Nations Institute for Disarmament Research","UNIDIR","United Nations Institute for Disarmament Research",41300,22]
[41210,"DGC","Department of Global Communications",null,"Département de la communication globale",41200,"NULL",null,null,41151,"IARC","International Agency for Research on Cancer","IARC","International Agency for Research on Cancer",41300]
[41211,"DMSPC","Department of Management Strategy, Policy and Compliance, including UNOG, UNOV and UNON",null,"Département des stratégies et politiques de gestion et de la conformité, y compris ? including ONUN, ONUG et ONUV",41200,"NULL",null,null,41201,"CTBTO","Comprehensive Nuclear Test Ban Treaty Organization","CTBTO","Comprehensive Nuclear Test Ban Treaty Organization",41200]
[41212,"DOS","Department of Operational Support",null,"Département de l’appui opérationnel",41200,"NULL",null,null,41202,"ICAO","International Civil Aviation Organization","ICAO","International Civil Aviation Organization",41200]
[41213,"DSS","Department of Safety and Security",null,"Département de la sûreté et de la sécurité",41200,"NULL",null,null,41203,"ICC","International Criminal Court","ICC","International Criminal Court",41200,22]
[41214,"OCT","Office of Counter-Terrorism",null,"Bureau de lutte contre le terrorisme",41200,"NULL",null,null,41204,"IRMCT","International Residual Mechanism for Criminal Tribunals","IRMCT","International Residual Mechanism for Criminal Tribunals",41200,22]
[41215,"UNICRI","United Nations Interregional Crime and Justice Research Institute",null,"Institut interrégional de recherche des Nations unies sur la criminalité et la justice",41200,"NULL",null,null,41205,"ISA","International Seabed Authority","ISA","International Seabed Authority",41200]
[41216,"IMO","International Maritime Organization","IMO","International Maritime Organization",41200,"NULL",null,null,41300," ","Other UN (Core Contributions Reportable in Part)"," ","Other UN (Core Contributions Reportable in Part)",41000]
[41217,"WTO","World Trade Organisation","WTO","Organisation mondiale du commerce",41200,"NULL",null,null,41206,"ITLOS","International Tribunal for the Law of the Sea","ITLOS","International Tribunal for the Law of the Sea",41200]
[41300," ","Other UN (Core Contributions Reportable in Part)"," ","Autres Nations Unies (contributions comptabilisables pour partie)",41000,"NULL",null,null,41207,"OPCW","Organization for the Prohibition of Chemical Weapons","OPCW","Organization for the Prohibition of Chemical Weapons",41200]
[41104,"ECLAC","Economic Commission for Latin America and the Caribbean","CEPALC","Commission économique pour l'Amérique latine et les Caraïbes",41300,"B021",null,null,41208,"DESA","Department of Economic and Social Affairs","DESA","Department of Economic and Social Affairs",41200]
[41105,"ESCWA","Economic and Social Commission for Western Asia","CESAO","Commission économique et sociale pour l'Asie occidentale",41300,"B021",null,null,41209,"DGACM","Department of General Assembly and Conference Management","DGACM","Department of General Assembly and Conference Management",41200]
[41106,"ESCAP","Economic and Social Commission for Asia and the Pacific ","CESAP","Commission économique et sociale pour l'Asie et le Pacifique",41300,"B021",null,null,41210,"DGC","Department of Global Communications","DGC","Department of Global Communications",41200]
[41128,"UNODC","United Nations Office on Drugs and Crime ","UNODC","Office des Nations Unies contre la drogue et le crime",41300,"B021",null,null,41211,"DMSPC","Department of Management Strategy, Policy and Compliance, including UNOG, UNOV and UNON","DMSPC","Department of Management Strategy, Policy and Compliance, including UNOG, UNOV and UNON",41200]
[41150,"UNIDIR","United Nations Institute for Disarmament Research","UNIDIR","Institut des Nations unies pour la recherche sur le désarmement",41300,"B021",null,null,41212,"DOS","Department of Operational Support","DOS","Department of Operational Support",41200]
[41151,"IARC","International Agency for Research on Cancer","CIRC","Centre international de recherche sur le cancer",41300,"B021",null,null,41213,"DSS","Department of Safety and Security","DSS","Department of Safety and Security",41200]
[41301,"FAO","Food and Agricultural Organisation","FAO","Organisation des Nations Unies pour l'alimentation et l'agriculture",41300,"B021",null,null,41214,"OCT","Office of Counter-Terrorism","OCT","Office of Counter-Terrorism",41200,22]
[41302,"ILO-Assessed","International Labour Organisation - Assessed Contributions","OIT-Obligatoires","Organisation internationale du travail - contributions obligatoires",41300,"B021",null,null,41215,"UNICRI","United Nations Interregional Crime and Justice Research Institute","UNICRI","United Nations Interregional Crime and Justice Research Institute",41200]
[41303,"ITU","International Telecommunications Union","UIT","Union internationale des télécommunications",41300,"B021",null,null,41216,"IMO","International Maritime Organization","IMO","International Maritime Organization",41200]
[41304,"UNESCO","United Nations Educational, Scientific and Cultural Organisation","UNESCO","Organisation des Nations Unies pour l’éducation, la science et la culture ",41300,"B021",null,null,41217,"WTO","World Trade Organisation","WTO","World Trade Organisation",41200,22]
[41305,"UN","United Nations","ONU","Organisation des Nations Unies",41300,"B021",null,null,41301,"FAO","Food and Agricultural Organisation","FAO","Food and Agricultural Organisation",41300,22]
[41306,"UPU","Universal Postal Union ","UPU","Union postale universelle",41300,"B021",null,null,41302,"ILO-Assessed","International Labour Organisation - Assessed Contributions","ILO-Assessed","International Labour Organisation - Assessed Contributions",41300,22]
[41307,"WHO-Assessed","World Health Organisation - assessed contributions","OMS-obligatoires","Organisation mondiale de la santé - contributions obligatoires",41300,"B021",null,null,41303,"ITU","International Telecommunications Union","ITU","International Telecommunications Union",41300]
[41308,"WIPO","World Intellectual Property Organisation ","OMPI","Organisation mondiale de la propriété intellectuelle ",41300,"B021",null,null,41304,"UNESCO","United Nations Educational, Scientific and Cultural Organisation","UNESCO","United Nations Educational, Scientific and Cultural Organisation",41300]
[41309,"WMO","World Meteorological Organisation ","OMM","Organisation météorologique mondiale",41300,"B021",null,null,41305,"UN","United Nations","UN","United Nations",41300,22]
[41310,"UNDPO-UN Peacekeeping operations","United Nations Department of Peace Operations - UN peacekeeping operations [only MINURSO, MINUSCA, MINUSMA, MINUJUSTH, MONUSCO, UNAMID, UNIFIL, UNISFA, UNMIK, UNMIL, UNMISS, UNOCI]. Report contributions mission by mission in CRS++.","UNDPO","Département des opérations de paix des Nations unies. Opérations de maintien de la paix [seulement MINURSO,MINUSCA,MINUSMA, MINUSTAH,MONUSCO,MINUAD, FINUL,FISNUA,MINUK, MINUL,UNMISS,ONUCI]. Notifier les contributions mission par mission au format SNPC++",41300,"B021",null,null,41306,"UPU","Universal Postal Union ","UPU","Universal Postal Union ",41300]
[41312,"IAEA-Assessed","International Atomic Energy Agency - assessed contributions","AIEA-obligatoires","Agence internationale de l'énergie atomique - contributions obligatoires",41300,"B021",null,null,41307,"WHO-Assessed","World Health Organisation - assessed contributions","WHO-Assessed","World Health Organisation - assessed contributions",41300,22]
[41313,"OHCHR","United Nations High Commissioner for Human Rights (extrabudgetary contributions only)","HCDH","Haut-Commissariat des Nations unies aux droits de l'homme (contributions extrabudgétaires uniquement)",41300,"B021",null,null,41308,"WIPO","World Intellectual Property Organisation ","WIPO","World Intellectual Property Organisation ",41300]
[41314,"UNECE","United Nations Economic Commission for Europe (extrabudgetary contributions only)","CEE-ONU","Commission économique des Nations unies pour l'Europe (contributions extrabudgétaires uniquement)",41300,"B021",null,null,41309,"WMO","World Meteorological Organisation ","WMO","World Meteorological Organisation ",41300]
[41315,"UNDRR","United Nations Office for Disaster Risk Reduction","UNDRR","Bureau des Nations Unies pour la prévention de catastrophes",41300,"B021",null,null,41310,"UNDPO-UN Peacekeeping operations","United Nations Department of Peace Operations - UN peacekeeping operations","UNDPO-UN Peacekeeping operations","United Nations Department of Peace Operations - UN peacekeeping operations",41300,21]
[41316,"UNFCCC","United Nations Framework Convention on Climate Change ","CCNUCC","Convention-cadre des Nations unies sur les changements climatiques",41300,"B021",null,null,41312,"IAEA-Assessed","International Atomic Energy Agency - assessed contributions","IAEA-Assessed","International Atomic Energy Agency - assessed contributions",41300,22]
[41319,"UNWTO","World Tourism Organization","OMT","Organisation mondiale du tourisme",41300,"B021",null,null,41313,"OHCHR","United Nations High Commissioner for Human Rights (extrabudgetary contributions only)","OHCHR","United Nations High Commissioner for Human Rights (extrabudgetary contributions only)",41300]
[41321,"WHO-SPRP","World Health Organisation - Strategic Preparedness and Response Plan","OMS-PSPI","Organisation mondiale de la santé - Plan stratégique de préparation et d'intervention",41300,"B021",null,null,41400," ","UN inter-agency pooled funds"," ","UN inter-agency pooled funds",41000]
[41502,"UNOPS","United Nations Office for Project Services","UNOPS","Le Bureau des Nations Unies pour les services d'appui aux projets ",41300,"n.a.",null,null,41314,"UNECE","United Nations Economic Commission for Europe (extrabudgetary contributions only)","UNECE","United Nations Economic Commission for Europe (extrabudgetary contributions only)",41300]
[41400," ","UN inter-agency pooled funds"," ","Fonds communs interinstitutions des Nations Unies",41000,"NULL",null,null,41315,"UNDRR","United Nations Office for Disaster Risk Reduction","UNDRR","United Nations Office for Disaster Risk Reduction",41300]
[41141,"PBF","United Nations Peacebuilding Fund","PBF","Fonds des Nations Unies pour la consolidation de la paix",41400,"B022",null,null,41316,"UNFCCC","United Nations Framework Convention on Climate Change ","UNFCCC","United Nations Framework Convention on Climate Change ",41300]
[41147,"CERF","Central Emergency Response Fund","CERF","Fonds central pour les interventions d'urgence",41400,"B022",null,null,41317,"GCF","Green Climate Fund","GCF","Green Climate Fund",47000,21]
[41401,"UN-MPTFO","UN-Multi Partner Trust Fund Office","UN-MPTFO","UN-Multi Partner Trust Fund Office",41400,"B031",null,null,41318,"GM","Global Mechanism","GM","Global Mechanism",41600]
[41402,"Joint SDG Fund","Joint Sustainable Development Goals Fund","Fonds conjoint des ODD","Fonds conjoint des objectifs de développement durable",41400,"B022",null,null,41319,"UNWTO","World Tourism Organization","UNWTO","World Tourism Organization",41300,22]
[41403,"COVID-19 MPTF","COVID-19 Response and Recovery Multi-Partner Trust Fund","COVID-19 MPTF","COVID-19 Response and Recovery Multi-Partner Trust Fund",41400,"B022",null,null,41320,"UN-TBLDC","Technology Bank for Least Developed Countries","UN-TBLDC","Technology Bank for Least Developed Countries",41100]
[41501,"UN-REDD","United Nations Reducing Emissions from Deforestation and Forest Degradation","NULL","United Nations Reducing Emissions from Deforestation and Forest Degradation",41400,"B031",null,null,41500," ","UN single-agency thematic funds"," ","UN single-agency thematic funds",41000]
[41503,"UN-CBPF","UN-led Country-based Pooled Funds","NULL","UN-led Country-based Pooled Funds",41400,"B031",null,null,41321,"WHO-SPRP","World Health Organisation - Strategic Preparedness and Response Plan","WHO-SPRP","World Health Organisation - Strategic Preparedness and Response Plan",41300,22]
[41500," ","UN single-agency thematic funds"," ","Fonds thématiques uniques des Nations Unies",41000,"NULL",null,null,41600," ","Existing UN channels not included in Standard I - UN entity- of the UN Data Cube reporting framework"," ","Existing UN channels not included in Standard I - UN entity- of the UN Data Cube reporting framework",41000]
[41148,"UNDPPA-SZA","United Nations Department of Political and Peacebuilding Affairs, Trust Fund in Support of Political Affairs","UNDPPA-SZA","Département des affaires politiques et de consolidation de la paix des Nations Unies, Fonds d'affectation spéciale à l'appui des affaires politiques",41500,"B032",null,null,41401,"UN-MPTFO","UN-Multi Partner Trust Fund Office","UN-MPTFO","UN-Multi Partner Trust Fund Office",41400,22]
[41600," ","Existing UN channels not included in Standard I - UN entity- of the UN Data Cube reporting framework"," ","Canaux de l'ONU existants non inclus dans la norme I du cadre de reporting du cube de l'ONU",41000,"NULL",null,null,41402,"Joint SDG Fund","Joint Sustainable Development Goals Fund","Joint SDG Fund","Joint Sustainable Development Goals Fund",41400,21]
[41126,"UNMAS","United Nations Mine Action Service ","UNMAS","Service de l'action antimines des Nations Unies",41600,"B022",null,null,41403,"COVID-19 MPTF","COVID-19 Response and Recovery Multi-Partner Trust Fund","COVID-19 MPTF","COVID-19 Response and Recovery Multi-Partner Trust Fund",41400,21]
[41132,"UNSCN","United Nations System Standing Committee on Nutrition ","UNSCN","Comité permanent de la nutrition du système des Nations Unies",41600,"n.a.",null,null,41501,"UN-REDD","United Nations Reducing Emissions from Deforestation and Forest Degradation","UN-REDD","United Nations Reducing Emissions from Deforestation and Forest Degradation",41400]
[41133,"UNSIA","United Nations Special Initiative on Africa ","UNSIA","Initiative spéciale des Nations Unies pour l'Afrique",41600,"B032",null,null,41502,"UNOPS","United Nations Office for Project Services","UNOPS","United Nations Office for Project Services",41300]
[41136,"UNVFD","United Nations Voluntary Fund on Disability ","NULL","Fonds de contributions voluntaires des Nations Unies pour les handicapés",41600,"B032",null,null,41503,"UN-CBPF","UN-led Country-based Pooled Funds","UN-CBPF","UN-led Country-based Pooled Funds",41400]
[41137,"UNVFTC","United Nations Voluntary Fund for Technical Co-operation in the Field of Human Rights","NULL","Fonds de contributions volontaires des Nations Unies pour la coopération technique dans le domaine des droits de l'homme",41600,"B032",null,null,41601,"UNODA","United Nations Office for Disarmament Affairs","UNODA","United Nations Office for Disarmament Affairs",41600,22]
[41138,"UNVFVT","United Nations Voluntary Fund for Victims of Torture ","NULL","Fonds de contributions volontaires des Nations Unies pour les victimes de la torture ",41600,"B032",null,null,43001,"IMF-PRGT","International Monetary Fund - Poverty Reduction and Growth Trust ","IMF-PRGT","International Monetary Fund - Poverty Reduction and Growth Trust ",43000,21]
[41142,"UNDEF","United Nations Democracy Fund","FNUD","Fonds des Nations Unies pour la démocratie",41600,"B032",null,null,43002,"IMF-PRG-HIPC","International Monetary Fund - Poverty Reduction and Growth - Heavily Indebted Poor Countries Debt Relief Initiative Trust Fund [includes HIPC, Extended Credit Facility (ECF), and ECF-HIPC sub-accounts] ","IMF-PRG-HIPC","International Monetary Fund - Poverty Reduction and Growth - Heavily Indebted Poor Countries Debt Relief Initiative Trust Fund [includes HIPC, Extended Credit Facility (ECF), and ECF-HIPC sub-accounts] ",43000]
[41318,"GM","Global Mechanism","MM","Mécanisme mondial",41600,"B032",null,null,43003,"IMF-EPCA-ENDA","International Monetary Fund - Subsidization of Emergency Post Conflict Assistance/Emergency Assistance for Natural Disasters for PRGT-eligible members","IMF-EPCA-ENDA","International Monetary Fund - Subsidization of Emergency Post Conflict Assistance/Emergency Assistance for Natural Disasters for PRGT-eligible members",43000]
[41601,"UNODA","United Nations Office for Disarmament Affairs","UNODA","United Nations Office for Disarmament Affairs",41600,"NULL",null,null,43004,"IMF-PRG-MDRI","International Monetary Fund - Poverty Reduction and Growth - Multilateral Debt Relief Initiative Trust","IMF-PRG-MDRI","International Monetary Fund - Poverty Reduction and Growth - Multilateral Debt Relief Initiative Trust",43000]
[47065,"IOC","Intergovernmental Oceanographic Commission ","COI","Commission océanographique intergouvernementale",41600,"B032",null,null,41700," ","UN entities, non-core contributions"," ","UN entities, non-core contributions",41000]
[47078,"Montreal Protocol","Multilateral Fund for the Implementation of the Montreal Protocol ","Protocol de Montréal","Fonds multilatéral pour l’application du Protocole de Montréal ",41600,"B022",null,null,41701,"ILO-non-core","International Labour Organisation - non-core","ILO-non-core","International Labour Organisation - non-core",41700,21]
[41701,"ILO-non-core","International Labour Organisation - non-core","ILO-non-core","International Labour Organisation - non-core",41700,"NULL",null,null,41702,"WHO-non-core","World Health Organisation - non-core","WHO-non-core","World Health Organisation - non-core",41700,22]
[41702,"WHO-non-core","World Health Organisation - non-core","WHO-non-core","World Health Organisation - non-core",41700,"NULL",null,null,42000," ","European Union Institutions"," ","European Union Institutions",40000]
[42000," ","European Union Institutions"," ","Institutions de l'Union européenne",40000,"NULL",null,null,42001,"EC","European Commission - Development Share of Budget","EC","European Commission - Development Share of Budget",42000,21]
[42001,"EC","European Commission - Development Share of Budget","CE","Commission européenne - partie du budget affectée au développement",42000,"B021",null,null,42003,"EDF","European Commission - European Development Fund","EDF","European Commission - European Development Fund",42000,21]
[42003,"EDF","European Commission - European Development Fund","FED","Commission européenne - Fonds européen de développement",42000,"B021",null,null,42004,"EIB","European Investment Bank ","EIB","European Investment Bank ",42000,21]
[42004,"EIB","European Investment Bank ","BEI","Banque européenne d'investissement",42000,"B021",null,null,43000," ","International Monetary Fund (IMF)"," ","International Monetary Fund (IMF)",40000]
[43000," ","International Monetary Fund (IMF)"," ","Fonds monétaire international (FMI)",40000,"NULL",null,null,43005,"IMF-PCDR","International Monetary Fund - Post-Catastrophe Debt Relief Trust","IMF-PCDR","International Monetary Fund - Post-Catastrophe Debt Relief Trust",43000]
[43001,"IMF-PRGT","International Monetary Fund - Poverty Reduction and Growth Trust ","FMI-FRPC","Fonds monétaire international – Facilité pour la réduction de la pauvreté et pour la croissance",43000,"B022",null,null,43006,"IMF-CCR","Catastrophe Containment and Relief Trust","IMF-CCR","Catastrophe Containment and Relief Trust",43000]
[43002,"IMF-PRG-HIPC","International Monetary Fund - Poverty Reduction and Growth - Heavily Indebted Poor Countries Debt Relief Initiative Trust Fund [includes HIPC, Extended Credit Facility (ECF), and ECF-HIPC sub-accounts] ","FMI-FRPC-PPTE","Fonds monétaire international – Réduction de la pauvreté et croissance – Initiative d’allègement de la dette en faveur des pays pauvres très endettés [y compris Initiative PPTE, Facilité élargie de crédit (FEC) et sous-comptes (FEC-PPTE)]",43000,"B022",null,null,43007,"IMF-RST","IMF’s Resilience and Sustainability Trust","IMF-RST","IMF’s Resilience and Sustainability Trust",43000,21]
[43003,"IMF-EPCA-ENDA","International Monetary Fund - Subsidization of Emergency Post Conflict Assistance/Emergency Assistance for Natural Disasters for PRGT-eligible members","FMI-EPCA-ENDA","Fonds monétaire international – Aide d’urgence après un conflit (EPCA) et aide d’urgence à la suite de catastrophes naturelles (ENDA) pour les membres pouvant bénéficier de la FRPC",43000,"B022",null,null,44001,"IBRD","International Bank for Reconstruction and Development ","IBRD","International Bank for Reconstruction and Development ",44000]
[43004,"IMF-PRG-MDRI","International Monetary Fund - Poverty Reduction and Growth - Multilateral Debt Relief Initiative Trust","FMI-FRPC-IADM","Fonds monétaire international – Facilité pour la réduction de la pauvreté et pour la croissance – Initiative d’allègement de la dette multilatérale",43000,"n.a.",null,null,44002,"IDA","International Development Association ","IDA","International Development Association ",44000]
[43005,"IMF-PCDR","International Monetary Fund - Post-Catastrophe Debt Relief Trust","FMI-ADAC","Fonds monétaire international  - Fonds fiduciaire pour l'allégement de la dette après une catastrophe",43000,"B022",null,null,44003,"IDA-HIPC","International Development Association - Heavily Indebted Poor Countries Debt Initiative Trust Fund ","IDA-HIPC","International Development Association - Heavily Indebted Poor Countries Debt Initiative Trust Fund ",44000]
[43006,"IMF-CCR","Catastrophe Containment and Relief Trust","FMI-ARC","Fonds fiduciaire d’assistance et de riposte aux catastrophes",43000,"B022",null,null,44004,"IFC","International Finance Corporation ","IFC","International Finance Corporation ",44000]
[43007,"IMF-RST","IMF’s Resilience and Sustainability Trust","FMI-RST","Fonds fiduciaire pour la résilience et la durabilité",43000,"B022",null,null,44000," ","World Bank Group (WB)"," ","World Bank Group (WB)",40000]
[44000," ","World Bank Group (WB)"," ","Groupe de la Banque mondiale (BM)",40000,"NULL",null,null,44005,"MIGA","Multilateral Investment Guarantee Agency ","MIGA","Multilateral Investment Guarantee Agency ",44000]
[44001,"IBRD","International Bank for Reconstruction and Development ","BIRD","Banque internationale pour la reconstruction et le développement",44000,"B021",null,null,44006,"AMCs","Advance Market Commitments","AMCs","Advance Market Commitments",44000]
[44002,"IDA","International Development Association ","IDA","Association internationale de développement",44000,"B021",null,null,44007,"IDA-MDRI","International Development Association - Multilateral Debt Relief Initiative","IDA-MDRI","International Development Association - Multilateral Debt Relief Initiative",44000]
[44003,"IDA-HIPC","International Development Association - Heavily Indebted Poor Countries Debt Initiative Trust Fund ","IDA-PPTE","Association internationale de développement - Fonds fiduciaire de l'IDA en faveur des pays pauvres très endettés",44000,"B022",null,null,44008,"PMI","Partnership for Market Implementation","PMI","Partnership for Market Implementation",44000]
[44004,"IFC","International Finance Corporation ","SFI","Société financière internationale ",44000,"B021",null,null,45001,"WTO-ITC","World Trade Organisation - International Trade Centre ","WTO-ITC","World Trade Organisation - International Trade Centre ",41100,21]
[44005,"MIGA","Multilateral Investment Guarantee Agency ","AMGI","Agence multilatérale de garantie des investissements",44000,"B021",null,null,45002,"WTO-ACWL","World Trade Organisation - Advisory Centre on WTO Law","WTO-ACWL","World Trade Organisation - Advisory Centre on WTO Law",41100]
[44006,"AMCs","Advance Market Commitments","AMC","Garanties de marché",44000,"B022",null,null,45003,"WTO-DDAGTF","World Trade Organisation - Doha Development Agenda Global Trust Fund ","WTO-DDAGTF","World Trade Organisation - Doha Development Agenda Global Trust Fund ",41100]
[44007,"IDA-MDRI","International Development Association - Multilateral Debt Relief Initiative","IDA-IADM","Association internationale de développement - Initiative d’allégement de la dette multilatérale",44000,"B021",null,null,46002,"Afr.DB","African Development Bank","Afr.DB","African Development Bank",46000,21]
[44008,"PMI","Partnership for Market Implementation","PMI","Partnership for Market Implementation",44000,"B021",null,null,46000," ","Regional Development Banks"," ","Regional Development Banks",40000]
[46000," ","Regional Development Banks"," ","Banques régionales de développement",40000,"NULL",null,null,46003,"Afr.DF","African Development Fund ","Afr.DF","African Development Fund ",46000,21]
[46002,"Afr.DB","African Development Bank","BAfD","Banque africaine de développement",46000,"B021",null,null,46004,"AsDB","Asian Development Bank","AsDB","Asian Development Bank",46000,21]
[46003,"Afr.DF","African Development Fund ","FAD","Fonds africain de développement",46000,"B021",null,null,46005,"AsDF","Asian Development Fund ","AsDF","Asian Development Fund ",46000,21]
[46004,"AsDB","Asian Development Bank","BAsD","Banque asiatique de développement",46000,"B021",null,null,46006,"BSTDB","Black Sea Trade and Development Bank","BSTDB","Black Sea Trade and Development Bank",46000,22]
[46005,"AsDF","Asian Development Fund ","FAsD","Fonds asiatique de développement",46000,"B021",null,null,46007,"CABEI","Central American Bank for Economic Integration ","CABEI","Central American Bank for Economic Integration ",46000,21]
[46006,"BSTDB","Black Sea Trade and Development Bank","BSTDB","Black Sea Trade and Development Bank",46000,"B021",null,null,46008,"CAF","Development Bank of Latin America","CAF","Development Bank of Latin America",46000,21]
[46007,"CABEI","Central American Bank for Economic Integration ","BCAIE","Banque centroaméricaine d'intégration économique",46000,"B021",null,null,46009,"CDB","Caribbean Development Bank ","CDB","Caribbean Development Bank ",46000,21]
[46008,"CAF","Development Bank of Latin America","CAF","Banque de développement de l'Amérique latine",46000,"B021",null,null,46012,"IDB","Inter-American Development Bank, Inter-American Investment Corporation and Multilateral Investment Fund ","IDB","Inter-American Development Bank, Inter-American Investment Corporation and Multilateral Investment Fund ",46000,21]
[46009,"CDB","Caribbean Development Bank ","BDC","Banque de développement des Caraïbes",46000,"B021",null,null,46013,"IDB FSO","Inter-American Development Bank, Fund for Special Operations ","IDB FSO","Inter-American Development Bank, Fund for Special Operations ",46000,21]
[46012,"IDB","Inter-American Development Bank, Inter-American Investment Corporation and Multilateral Investment Fund ","BID","Banque interaméricaine de développement, Société interaméricaine d'investissements, Fonds multilatéral d'investissements",46000,"B021",null,null,46015,"EBRD","European Bank for Reconstruction and Development","EBRD","European Bank for Reconstruction and Development",46000,22]
[46013,"IDB FSO","Inter-American Development Bank, Fund for Special Operations ","BID FOS","Banque interaméricaine de développement, Fonds opérations spécial",46000,"B021",null,null,46016,"EBRD TFs - ODA Countries Only","European Bank for Reconstruction and Development - technical co-operation and special funds (ODA-eligible countries only)","EBRD TFs - ODA Countries Only","European Bank for Reconstruction and Development - technical co-operation and special funds (ODA-eligible countries only)",46000,21]
[46015,"EBRD","European Bank for Reconstruction and Development","BERD","Banque européenne pour la reconstruction et le développement",46000,"B021",null,null,46017,"EBRD TFs - All Countries","European Bank for Reconstruction and Development - technical co-operation and special funds (all EBRD countries of operations)","EBRD TFs - All Countries","European Bank for Reconstruction and Development - technical co-operation and special funds (all EBRD countries of operations)",46000,22]
[46016,"EBRD TFs - ODA Countries Only","European Bank for Reconstruction and Development - technical co-operation and special funds (ODA-eligible countries only)","BERD-CTFS pays éligibles à l'APD","Banque européenne pour la reconstruction et le développement - coopération technique et fonds spéciaux (pays éligibles à l'APD)",46000,"B022",null,null,46018,"EBRD-ETC","European Bank for Reconstruction and Development - Early Transition Countries Fund","EBRD-ETC","European Bank for Reconstruction and Development - Early Transition Countries Fund",46000,21]
[46017,"EBRD TFs - All Countries","European Bank for Reconstruction and Development - technical co-operation and special funds (all EBRD countries of operations)","BERD-CTFS tous pays","Banque européenne pour la reconstruction et le développement - coopération technique et fonds spéciaux (tous pays)",46000,"B022",null,null,46019,"EBRD-WBJTF","European Bank for Reconstruction and Development - Western Balkans Joint Trust Fund","EBRD-WBJTF","European Bank for Reconstruction and Development - Western Balkans Joint Trust Fund",46000,22]
[46018,"EBRD-ETC","European Bank for Reconstruction and Development - Early Transition Countries Fund","BERD-ETC","Banque européenne de reconstruction et de développement - Initiative en faveur des pays en transition précoce",46000,"B022",null,null,46020,"BDEAC","Central African States Development Bank","BDEAC","Central African States Development Bank",46000]
[46019,"EBRD-WBJTF","European Bank for Reconstruction and Development - Western Balkans Joint Trust Fund","BERD-FSpBO","Banque européenne de reconstruction et de développement - Fonds spécial pour les Balkans occidentaux",46000,"B022",null,null,46021,"BOAD","West African Development Bank","BOAD","West African Development Bank",46000]
[46020,"BDEAC","Central African States Development Bank","BDEAC","Banque de développement des États de l'Afrique Centrale",46000,"B021",null,null,46022,"Afreximbank","African Export Import Bank","Afreximbank","African Export Import Bank",46000]
[46021,"BOAD","West African Development Bank","BOAD","Banque ouest-africaine de développement",46000,"B021",null,null,46023,"TDB","Eastern and Southern African Trade and Development Bank","TDB","Eastern and Southern African Trade and Development Bank",46000]
[46022,"Afreximbank","African Export Import Bank","Afreximbank","Banque Africaine d'Import-Export",46000,"B021",null,null,46024,"CEB","Council of Europe Development Bank","CEB","Council of Europe Development Bank",46000,22]
[46023,"TDB","Eastern and Southern African Trade and Development Bank","TDB","Banque de l’Afrique de l’Est et de l’Afrique Australe pour le Commerce et le Développement",46000,"B021",null,null,46025,"IsDB","Islamic Development Bank","IsDB","Islamic Development Bank",46000,21]
[46024,"CEB","Council of Europe Development Bank","CEB","Banque de Développement du Conseil de l'Europe",46000,"B021",null,null,46026,"AIIB","Asian Infrastructure Investment Bank","AIIB","Asian Infrastructure Investment Bank",46000,21]
[46025,"IsDB","Islamic Development Bank","BIsD","Banque Islamique de Développement",46000,"B021",null,null,46027,"FONPLATA","Financial Fund for the Development of the River Plate Basin","FONPLATA","Financial Fund for the Development of the River Plate Basin",46000]
[46026,"AIIB","Asian Infrastructure Investment Bank","BAII","Asian Infrastructure Investment Bank",46000,"B021",null,null,46028,"NDB","New Development Bank","NDB","New Development Bank",46000,21]
[46027,"FONPLATA","Financial Fund for the Development of the River Plate Basin","FONPLATA","Fonds financier pour le développement du bassin fluvial de la Plata",46000,"B021",null,null,47001,"ACBF","African Capacity Building Foundation ","ACBF","African Capacity Building Foundation ",47000]
[46028,"NDB","New Development Bank","NDB","Nouvelle banque de développement",46000,"B02",null,null,47000," ","Other multilateral institutions"," ","Other multilateral institutions",40000]
[47000," ","Other multilateral institutions"," ","Autres institutions multilatérales",40000,"NULL",null,null,47002,"APO","Asian Productivity Organisation ","APO","Asian Productivity Organisation ",47000]
[21002,"AITIC","Agency for International Trade Information and Co-operation ","ACICI","Agence de coopération et d'information pour le commerce international",47000,"n.a.",null,null,47003,"ASEAN","Association of South East Asian Nations: Economic Co-operation ","ASEAN","Association of South East Asian Nations: Economic Co-operation ",47000]
[41102,"DLCO-EA","Desert Locust Control Organisation for Eastern Africa ","OLCP-EA","Organisation de lutte contre le criquet pèlerin dans l'Est Africain",47000,"B021",null,null,47005,"AU","African Union","AU","African Union",47000]
[41317,"GCF","Green Climate Fund","GCF","Fonds vert pour le climat",47000,"B022",null,null,47009,"CAMES","African and Malagasy Council for Higher Education ","CAMES","African and Malagasy Council for Higher Education ",47000]
[47001,"ACBF","African Capacity Building Foundation ","ACBF","Fondation pour le renforcement des capacités en Afrique",47000,"B021",null,null,47011,"CARICOM","Caribbean Community Secretariat ","CARICOM","Caribbean Community Secretariat ",47000]
[47002,"APO","Asian Productivity Organisation ","APO","Organisation asiatique de productivité",47000,"B021",null,null,47012,"CAREC","Caribbean Epidemiology Centre ","CAREC","Caribbean Epidemiology Centre ",47000]
[47003,"ASEAN","Association of South East Asian Nations: Economic Co-operation ","ANASE","Association des nations de l'Asie du Sud-Est - coopération économique",47000,"B021",null,null,47013,"CF","Commonwealth Foundation ","CF","Commonwealth Foundation ",47000]
[47005,"AU","African Union (excluding peacekeeping facilities) ","UA","Union Africaine (à l'exclusion de la Facilité de soutien à la paix)",47000,"B021",null,null,47015,"CGIAR","CGIAR Fund","CGIAR","CGIAR Fund",47000,21]
[47009,"CAMES","African and Malagasy Council for Higher Education ","CAMES","Conseil africain et malgache pour l'enseignement supérieur",47000,"B021",null,null,47019,"CIHEAM","International Centre for Advanced Mediterranean Agronomic Studies ","CIHEAM","International Centre for Advanced Mediterranean Agronomic Studies ",47000]
[47011,"CARICOM","Caribbean Community Secretariat ","CARICOM","Secrétariat de la Communauté des Caraïbes ",47000,"B021",null,null,47022,"CITES","Convention on International Trade in Endangered Species of Wild Flora and Fauna","CITES","Convention on International Trade in Endangered Species of Wild Flora and Fauna",47000]
[47012,"CAREC","Caribbean Epidemiology Centre ","CAREC","Centre épidémiologique des Caraïbes",47000,"n.a.",null,null,47025,"COL","Commonwealth of Learning ","COL","Commonwealth of Learning ",47000]
[47013,"CF","Commonwealth Foundation ","CF","Fondation du Commonwealth",47000,"B021",null,null,47026,"CPLP","Community of Portuguese Speaking Countries ","CPLP","Community of Portuguese Speaking Countries ",47000]
[47015,"CGIAR","CGIAR Fund","CGIAR","CGIAR Fund",47000,"B022",null,null,47027,"CP ","Colombo Plan","CP ","Colombo Plan",47000]
[47019,"CIHEAM","International Centre for Advanced Mediterranean Agronomic Studies ","CIHEAM","Centre international de hautes études agronomique méditerranéennes",47000,"B021",null,null,47029,"SWAC","Sahel and West Africa Club ","SWAC","Sahel and West Africa Club ",47000]
[47022,"CITES","Convention on International Trade in Endangered Species of Wild Flora and Fauna","CITES","Convention sur le commerce international des espèces de faune et de flore sauvages menacées d'extinction",47000,"B021",null,null,47034,"ECOWAS","Economic Community of West African States ","ECOWAS","Economic Community of West African States ",47000]
[47025,"COL","Commonwealth of Learning ","COL","Commonwealth of Learning",47000,"B021",null,null,47036,"EPPO","European and Mediterranean Plant Protection Organisation ","EPPO","European and Mediterranean Plant Protection Organisation ",47000]
[47026,"CPLP","Community of Portuguese Speaking Countries ","CPLP","Communauté des pays de langue portugaise ",47000,"B021",null,null,47037,"EROPA","Eastern-Regional Organisation of Public Administration ","EROPA","Eastern-Regional Organisation of Public Administration ",47000]
[47027,"CP ","Colombo Plan","CP","Plan de Colombo",47000,"B021",null,null,47040,"FFA","Forum Fisheries Agency ","FFA","Forum Fisheries Agency ",47000]
[47029,"SWAC","Sahel and West Africa Club ","CSAO","Club du Sahel et de l’Afrique de l’Ouest ",47000,"B021",null,null,47044,"GEF","Global Environment Facility Trust Fund","GEF","Global Environment Facility Trust Fund",47000,21]
[47034,"ECOWAS","Economic Community of West African States ","CEDEAO","Communauté économique des Etats de l’Afrique de l’Ouest",47000,"B021",null,null,47045,"Global Fund","Global Fund to Fight AIDS, Tuberculosis and Malaria ","Global Fund","Global Fund to Fight AIDS, Tuberculosis and Malaria ",47000,21]
[47036,"EPPO","European and Mediterranean Plant Protection Organisation ","OEPP","Organisation Européenne et Méditerranéenne pour la Protection des Plantes",47000,"B021",null,null,47046,"OIF","International Organisation of the Francophonie","OIF","International Organisation of the Francophonie",47000]
[47037,"EROPA","Eastern-Regional Organisation of Public Administration ","EROPA","Organisation régionale de l'Orient pour l'administration publique",47000,"B021",null,null,47050,"ICAC","International Cotton Advisory Committee ","ICAC","International Cotton Advisory Committee ",47000]
[47040,"FFA","Forum Fisheries Agency ","FFA","Agence des pêches ",47000,"B021",null,null,47058,"IDEA","International Institute for Democracy and Electoral Assistance ","IDEA","International Institute for Democracy and Electoral Assistance ",47000]
[47044,"GEF","Global Environment Facility Trust Fund","FEM","Fonds pour l'environnement mondial - fonds fiduciaire",47000,"B022",null,null,47059,"IDLO","International Development Law Organisation ","IDLO","International Development Law Organisation ",47000]
[47045,"Global Fund","Global Fund to Fight AIDS, Tuberculosis and Malaria ","Fonds mondial","Fonds mondial de lutte contre le SIDA, la tuberculose et la paludisme",47000,"B022",null,null,47061,"IICA","Inter-American Institute for Co-operation on Agriculture ","IICA","Inter-American Institute for Co-operation on Agriculture ",47000]
[47046,"OIF","International Organisation of the Francophonie","OIF","Organisation internationale de la Francophonie ",47000,"B021",null,null,47064,"INBAR","International Network for Bamboo and Rattan ","INBAR","International Network for Bamboo and Rattan ",47000]
[47050,"ICAC","International Cotton Advisory Committee ","CCIC","Comité consultatif international du coton",47000,"B021",null,null,47065,"IOC","Intergovernmental Oceanographic Commission ","IOC","Intergovernmental Oceanographic Commission ",41600]
[47058,"IDEA","International Institute for Democracy and Electoral Assistance ","IDEA","International Institute for Democracy and Electoral Assistance",47000,"B021",null,null,47066,"IOM","International Organisation for Migration ","IOM","International Organisation for Migration ",41100]
[47059,"IDLO","International Development Law Organisation ","IDLO","Organisation internationale de droit du développement ",47000,"B021",null,null,47067,"IPCC","Intergovernmental Panel on Climate Change ","IPCC","Intergovernmental Panel on Climate Change ",47000]
[47061,"IICA","Inter-American Institute for Co-operation on Agriculture ","IICA","Institut interaméricain de coopération pour l’agriculture",47000,"B021",null,null,47068,"APFIC","Asia-Pacific Fishery Commission","APFIC","Asia-Pacific Fishery Commission",47000]
[47064,"INBAR","International Network for Bamboo and Rattan ","INBAR","Réseau International sur le bambou et le rotin",47000,"B021",null,null,47073,"ITTO","International Tropical Timber Organisation ","ITTO","International Tropical Timber Organisation ",47000]
[47067,"IPCC","Intergovernmental Panel on Climate Change ","GIEC","Groupe d’experts intergouvernemental sur l’évolution du climat",47000,"B021",null,null,47074,"IVI","International Vaccine Institute ","IVI","International Vaccine Institute ",47000]
[47068,"APFIC","Asia-Pacific Fishery Commission","APFIC","Commission Asie-Pacifique des pêches",47000,"B021",null,null,47076,"JSCA","Justice Studies Centre of the Americas ","JSCA","Justice Studies Centre of the Americas ",47000]
[47073,"ITTO","International Tropical Timber Organisation ","OIBT","Organisation Internationale des Bois Tropicaux",47000,"B021",null,null,47077,"MRC","Mekong River Commission ","MRC","Mekong River Commission ",47000]
[47074,"IVI","International Vaccine Institute ","IIV","Institut international de vaccins ",47000,"B021",null,null,47078,"Montreal Protocol","Multilateral Fund for the Implementation of the Montreal Protocol ","Montreal Protocol","Multilateral Fund for the Implementation of the Montreal Protocol ",41600]
[47076,"JSCA","Justice Studies Centre of the Americas ","JSCA","Centre d’études sur la justice dans les Amériques",47000,"B021",null,null,47079,"OAS","Organisation of American States ","OAS","Organisation of American States ",47000,21]
[47077,"MRC","Mekong River Commission ","MRC","Commission du Mékong",47000,"B021",null,null,47080,"OECD","Organisation for Economic Co-operation and Development","OECD","Organisation for Economic Co-operation and Development",47000]
[47079,"OAS","Organisation of American States ","OEA","Organisation des États américains",47000,"B021",null,null,47081,"OECD-Dev. Centre","OECD Development Centre ","OECD-Dev. Centre","OECD Development Centre ",47000]
[47080,"OECD","Organisation for Economic Co-operation and Development (Contributions to special funds for Technical Co-operation Activities Only) ","OCDE","Organisation de Coopération et de développement économiques (contributions aux fonds spéciaux pour les activités de coopération technique uniquement)",47000,"B022",null,null,47082,"OECS","Organisation of Eastern Caribbean States ","OECS","Organisation of Eastern Caribbean States ",47000]
[47081,"OECD-Dev. Centre","OECD Development Centre ","OCDE-Centre de dév. ","OCDE Centre de développement",47000,"B021",null,null,47083,"PAHO","Pan-American Health Organisation ","PAHO","Pan-American Health Organisation ",41100]
[47082,"OECS","Organisation of Eastern Caribbean States ","OECO","Organisation des États des Caraïbes orientales",47000,"B021",null,null,47084,"PAIGH","Pan-American Institute of Geography and History ","PAIGH","Pan-American Institute of Geography and History ",47000]
[47084,"PAIGH","Pan-American Institute of Geography and History ","PAIGH","Institut panaméricain de géographie et d’histoire",47000,"B021",null,null,47086,"PIDG","Private Infrastructure Development Group ","PIDG","Private Infrastructure Development Group ",47000,21]
[47086,"PIDG","Private Infrastructure Development Group ","PIDG","Private Infrastructure Development Group",47000,"B021",null,null,47087,"PIFS","Pacific Islands Forum Secretariat ","PIFS","Pacific Islands Forum Secretariat ",47000]
[47087,"PIFS","Pacific Islands Forum Secretariat ","SFIP","Secrétariat du Forum des Iles du Pacifique",47000,"B021",null,null,47089,"SADC","Southern African Development Community ","SADC","Southern African Development Community ",47000]
[47089,"SADC","Southern African Development Community ","SADC","Communauté pour le développement de l’Afrique australe",47000,"B021",null,null,47092,"SEAFDC","South East Asian Fisheries Development Centre ","SEAFDC","South East Asian Fisheries Development Centre ",47000]
[47092,"SEAFDC","South East Asian Fisheries Development Centre ","SEAFDC","Centre de développement des pêches de l’Asie du Sud-Est",47000,"B021",null,null,47093,"SEAMEO","South East Asian Ministers of Education ","SEAMEO","South East Asian Ministers of Education ",47000]
[47093,"SEAMEO","South East Asian Ministers of Education ","SEAMEO","Organisation des Ministres de l’éducation de l’Asie du Sud-Est",47000,"B021",null,null,47095,"EQAP","Educational Quality and Assessment Programme","EQAP","Educational Quality and Assessment Programme",47000]
[47095,"EQAP","Educational Quality and Assessment Programme","EQAP","Programme d'évaluation et de qualité de l'éducation",47000,"B021",null,null,47096,"SPC","Secretariat of the Pacific Community ","SPC","Secretariat of the Pacific Community ",47000]
[47096,"SPC","Secretariat of the Pacific Community ","CPS","Secrétariat Général de la Communauté du Pacifique",47000,"B021",null,null,47097,"SPREP","Pacific Regional Environment Programme ","SPREP","Pacific Regional Environment Programme ",47000]
[47097,"SPREP","Pacific Regional Environment Programme ","PROE","Programme régional océanien de l’environnement",47000,"B021",null,null,47098,"UNPO","Unrepresented Nations and Peoples’ Organisation ","UNPO","Unrepresented Nations and Peoples’ Organisation ",47000]
[47098,"UNPO","Unrepresented Nations and Peoples’ Organisation ","UNPO","Organisation des peuples et des nations non représentés",47000,"B021",null,null,47100,"WAMU","West African Monetary Union ","WAMU","West African Monetary Union ",47000]
[47100,"WAMU","West African Monetary Union ","UMOA","Union monétaire ouest-africaine",47000,"B021",null,null,47105,"CFC","Common Fund for Commodities ","CFC","Common Fund for Commodities ",47000]
[47105,"CFC","Common Fund for Commodities ","NULL","Fonds commun pour les produits de base",47000,"B022",null,null,47106,"DCAF","Geneva Centre for the Democratic Control of Armed Forces","DCAF","Geneva Centre for the Democratic Control of Armed Forces",47000]
[47106,"DCAF","Geneva Centre for the Democratic Control of Armed Forces","DCAF","Centre de contrôle démocratique des forces armées - Genève",47000,"B021",null,null,47107,"IFFIm","International Finance Facility for Immunisation","IFFIm","International Finance Facility for Immunisation",47000]
[47107,"IFFIm","International Finance Facility for Immunisation","IFFIm","Facilité internationale de financement pour la vaccination",47000,"B022",null,null,47109,"APEC-ASF","Asia-Pacific Economic Cooperation Support Fund","APEC-ASF","Asia-Pacific Economic Cooperation Support Fund",47000]
[47109,"APEC ASF","Asia-Pacific Economic Cooperation Support Fund (except contributions tied to counter-terrorism activities)","APEC-ASF","Fonds de soutien de la coopération économique Asie-Pacifique (hors lutte contre le terrorisme)",47000,"B022",null,null,47110,"BSEC","Organisation of the Black Sea Economic Cooperation","BSEC","Organisation of the Black Sea Economic Cooperation",47000]
[47110,"BSEC","Organisation of the Black Sea Economic Cooperation","BSEC","Organisation de coopération économique de la mer Noire",47000,"B021",null,null,47111," ","Adaptation Fund"," ","Adaptation Fund",47000,21]
[47111,"NULL","Adaptation Fund","NULL","Fonds pour l’adaptation",47000,"B022",null,null,47112,"CEI-Climate Fund","Central European Initiative - Special Fund for Climate and Environmental Protection","CEI-Climate Fund","Central European Initiative - Special Fund for Climate and Environmental Protection",47000]
[47112,"CEI-Climate Fund","Central European Initiative - Special Fund for Climate and Environmental Protection","CEI-Climate Fund","Initiative de l’Europe centrale - Fonds Spécial pour la protection climatique et environnementale",47000,"B032",null,null,47113,"CEMAC","Economic and Monetary Community of Central Africa ","CEMAC","Economic and Monetary Community of Central Africa ",47000]
[47113,"CEMAC","Economic and Monetary Community of Central Africa ","CEMAC","Communauté économique et monétaire de l’Afrique Centrale",47000,"B021",null,null,47114,"AFoCO","Asian Forest Cooperation Organisation","AFoCO","Asian Forest Cooperation Organisation",47000,21]
[47114,"AFoCO","Asian Forest Cooperation Organisation","AFoCO","Asian Forest Cooperation Organisation",47000,"B021",null,null,47116,"IF","Integrated Framework for Trade-Related Technical Assistance to Least Developed Countries","IF","Integrated Framework for Trade-Related Technical Assistance to Least Developed Countries",47000]
[47116,"IF","Integrated Framework for Trade-Related Technical Assistance to Least Developed Countries","CI","Cadre intégré pour l'assistance technique liée au commerce en faveur des pays les moins avancés",47000,"B021",null,null,47117,"NEPAD","New Partnership for Africa's Development","NEPAD","New Partnership for Africa's Development",47000]
[47117,"NEPAD","New Partnership for Africa's Development","NEPAD","Nouveau Partenariat pour le développement de l’Afrique",47000,"B021",null,null,47118,"CREFIAF","Regional Organisation for the Strengthening of Supreme Audit Institutions of Francophone Sub-Saharan Countries","CREFIAF","Regional Organisation for the Strengthening of Supreme Audit Institutions of Francophone Sub-Saharan Countries",47000]
[47118,"CREFIAF","Regional Organisation for the Strengthening of Supreme Audit Institutions of Francophone Sub-Saharan Countries","CREFIAF","Conseil Régional de Formation des Institutions Supérieures de Contrôle des Finances Publiques d’Afrique Francophone Subsaharienne",47000,"B021",null,null,47119,"OSS","Sahara and Sahel Observatory","OSS","Sahara and Sahel Observatory",47000]
[47119,"OSS","Sahara and Sahel Observatory","OSS","Observatoire du Sahara et du Sahel",47000,"B021",null,null,47120,"SAARC","South Asian Association for Regional Cooperation ","SAARC","South Asian Association for Regional Cooperation ",47000]
[47120,"SAARC","South Asian Association for Regional Cooperation ","SAARC","Association de l'Asie du Sud pour la coopération régionale",47000,"B021",null,null,47121,"UCLGA","United Cities and Local Governments of Africa","UCLGA","United Cities and Local Governments of Africa",47000]
[47121,"UCLGA","United Cities and Local Governments of Africa","CGLUA","Cités et gouvernements locaux unis d’Afrique",47000,"B021",null,null,47122,"GAVI","Global Alliance for Vaccines and Immunization ","GAVI","Global Alliance for Vaccines and Immunization ",47000,21]
[47122,"GAVI","Global Alliance for Vaccines and Immunization ","GAVI","Alliance mondiale pour la vaccination et l’immunisation",47000,"B022",null,null,47123,"GICHD","Geneva International Centre for Humanitarian Demining ","GICHD","Geneva International Centre for Humanitarian Demining ",47000]
[47123,"GICHD","Geneva International Centre for Humanitarian Demining ","CIDHG","Centre International de Déminage Humanitaire Genève",47000,"B021",null,null,47124,"IACA","International Anti-Corruption Academy","IACA","International Anti-Corruption Academy",47000]
[47124,"IACA","International Anti-Corruption Academy","IACA","International Anti-Corruption Academy",47000,"B021",null,null,47125,"ICGEB","International Centre for Genetic Engineering and Biotechnology","ICGEB","International Centre for Genetic Engineering and Biotechnology",47000,22]
[47125,"ICGEB","International Centre for Genetic Engineering and Biotechnology","ICGEB","International Centre for Genetic Engineering and Biotechnology",47000,"B021",null,null,47127,"OLADE","Latin-American Energy Organisation","OLADE","Latin-American Energy Organisation",47000]
[47127,"OLADE","Latin-American Energy Organisation","OLADE","Organisation latino-américaine de l'énergie",47000,"B021",null,null,47128,"NDF","Nordic Development Fund","NDF","Nordic Development Fund",47000,21]
[47128,"NDF","Nordic Development Fund","NDF","Nordic Development Fund",47000,"B021",null,null,47129,"GEF-LDCF","Global Environment Facility - Least Developed Countries Fund","GEF-LDCF","Global Environment Facility - Least Developed Countries Fund",47000]
[47129,"GEF-LDCF","Global Environment Facility - Least Developed Countries Fund","FEM-FPMA","FEM Fonds pour les pays les moins avancés",47000,"B022",null,null,47130,"GEF-SCCF","Global Environment Facility - Special Climate Change Fund","GEF-SCCF","Global Environment Facility - Special Climate Change Fund",47000]
[47130,"GEF-SCCF","Global Environment Facility - Special Climate Change Fund","FEM-FSpCC","FEM Fonds spécial pour les changements climatiques",47000,"B022",null,null,47131,"OSCE","Organization for Security and Co-operation in Europe","OSCE","Organization for Security and Co-operation in Europe",47000,22]
[47131,"OSCE","Organization for Security and Co-operation in Europe","OSCE","Organisation pour la sécurité et la coopération en Europe",47000,"B021",null,null,47132," ","Commonwealth Secretariat"," ","Commonwealth Secretariat",47000]
[47132,"NULL","Commonwealth Secretariat (ODA-eligible contributions only)","NULL","Secrétariat du Commonwealth (seulement les contributions éligibles à l'APD)",47000,"B021",null,null,47134,"CTF","Clean Technology Fund","CTF","Clean Technology Fund",47000,21]
[47134,"CTF","Clean Technology Fund","FTP","Fonds pour les technologies propres",47000,"B022",null,null,47135,"SCF","Strategic Climate Fund","SCF","Strategic Climate Fund",47000,21]
[47135,"SCF","Strategic Climate Fund","FSC","Fonds stratégique pour le climat",47000,"B022",null,null,47136,"GGGI","Global Green Growth Institute","GGGI","Global Green Growth Institute",47000,21]
[47136,"GGGI","Global Green Growth Institute","GGGI","Institut mondial de la croissance verte",47000,"B021",null,null,47137,"ARC","African Risk Capacity Group","ARC","African Risk Capacity Group",47000]
[47137,"ARC","African Risk Capacity Group","ARC","Mutuelle panafricaine de gestion des risques",47000,"B021",null,null,47138,"CoE","Council of Europe","CoE","Council of Europe",47000]
[47138,"CoE","Council of Europe","CoE","Conseil de l’Europe",47000,"B021",null,null,47139,"WCO CCF","World Customs Organization Customs Co-operation Fund","WCO CCF","World Customs Organization Customs Co-operation Fund",47000]
[47139,"WCO CCF","World Customs Organization Customs Co-operation Fund","OMD CCF","Organisation Mondiale des Douanes Fonds de coopération douanière",47000,"B033",null,null,47140,"OEI","Organisation of Ibero-American States for Education, Science and Culture","OEI","Organisation of Ibero-American States for Education, Science and Culture",47000]
[47140,"OEI","Organisation of Ibero-American States for Education, Science and Culture","OEI","Organisation des états ibéro-américains pour l'éducation, la science et la culture (OEI)",47000,"B021",null,null,47141,"ATAF","African Tax Administration Forum","ATAF","African Tax Administration Forum",47000]
[47141,"ATAF","African Tax Administration Forum","ATAF","Forum sur l’Administration Fiscale Africaine",47000,"B021",null,null,47142,"OFID","OPEC Fund for International Development","OFID","OPEC Fund for International Development",47000,21]
[47142,"OFID","OPEC Fund for International Development","OFID","Le Fonds OPEP pour le développement international",47000,"B022",null,null,47143,"GCERF","Global Community Engagement and Resilience Fund","GCERF","Global Community Engagement and Resilience Fund",47000]
[47143,"GCERF","Global Community Engagement and Resilience Fund","GCERF","Fonds mondial pour l’engagement de la communauté et la résilience",47000,"B022",null,null,47144,"IRENA","International Renewable Energy Agency","IRENA","International Renewable Energy Agency",47000]
[47144,"IRENA","International Renewable Energy Agency","IRENA","Agence internationale pour les energies renouvelables",47000,"B021",null,null,47145,"CEF","Center of Excellence in Finance","CEF","Center of Excellence in Finance",47000,21]
[47145,"CEF","Center of Excellence in Finance","NULL","Center of Excellence in Finance",47000,"B021",null,null,47146,"IIB","International Investment Bank","IIB","International Investment Bank",47000,22]
[47146,"IIB","International Investment Bank","NULL","International Investment Bank",47000,"B021",null,null,47147,"IFFEd","International Finance Facility for Education","IFFEd","International Finance Facility for Education",47000]
[47147,"IFFEd","International Finance Facility for Education","IFFEd","Facilité internationale de financement pour l'éducation",47000,"B022",null,null,47148,"WOAH","World Organisation for Animal Health","WOAH","World Organisation for Animal Health",47000,22]
[47148,"WOAH","World Organisation for Animal Health","WOAH","Organisation mondiale de la santé animale",47000,"B021",null,null,47149,"ICMP","International Commission on Missing Persons","ICMP","International Commission on Missing Persons",47000,21]
[47149,"ICMP","International Commission on Missing Persons","CIPD","Commission internationale pour les personnes disparues",47000,"B021",null,null,47151,"BADEA","Arab bank for economic development in Africa","BADEA","Arab bank for economic development in Africa",47000]
[47150,"SEGIB","Secretaría General Iberoamericana","SEGIB","Secretaría General Iberoamericana",47000,"B021",null,null,47152,"AFESD","Arab fund for economic and social development","AFESD","Arab fund for economic and social development",47000]
[47151,"BADEA","Arab bank for economic development in Africa","BADEA","Banque arabe de développement économique en Afrique",47000,"B02",null,null,47150,"SEGIB","Secretaría General Iberoamericana","SEGIB","Secretaría General Iberoamericana",47000]
[47152,"AFESD","Arab fund for economic and social development","FADES","Fonds arabe pour le développement économique et social",47000,"B02",null,null,47400," ","European Space Agency (ESA) programme 'Space in support of International Development Aid'"," ","European Space Agency (ESA) programme 'Space in support of International Development Aid'",47000]
[47400,"NULL","European Space Agency (ESA) programme 'Space in support of International Development Aid'","NULL","European Space Agency (ESA) programme 'Space in support of International Development Aid'",47000,"B032",null,null,47501,"GPE","Global Partnership for Education","GPE","Global Partnership for Education",47000,21]
[47501,"GPE","Global Partnership for Education","PME","Partenariat Mondial pour l'Education",47000,"B031",null,null,47502,"GFDRR","Global Fund for Disaster Risk Reduction","GFDRR","Global Fund for Disaster Risk Reduction",47000]
[47502,"GFDRR","Global Fund for Disaster Risk Reduction","NULL","Global Fund for Disaster Risk Reduction",47000,"B031",null,null,47503,"GAFSP","Global Agriculture and Food Security Program","GAFSP","Global Agriculture and Food Security Program",47000]
[47503,"GAFSP","Global Agriculture and Food Security Program","NULL","Global Agriculture and Food Security Program",47000,"B031",null,null,47504,"FCPF","Forest Carbon Partnership Facility ","FCPF","Forest Carbon Partnership Facility ",47000]
[47504,"FCPF","Forest Carbon Partnership Facility ","NULL","Forest Carbon Partnership Facility ",47000,"B032",null,null,47701,"GBFF","Global Biodiversity Framework Fund ","GBFF","Global Biodiversity Framework Fund ",47000]
[47701,"GEF-GBFF","Global Environment Facility - Global biodiversity framework fund","FEM-FCMB","FEM Fonds du cadre mondial pour la biodiversité",47000,"B02",null,null,47702,"Cali Fund ","Cali Fund For the Fair and Equitable Sharing of Benefits from the use of Digital Sequence Information on Genetic Resources (DSI)","Cali Fund ","Cali Fund For the Fair and Equitable Sharing of Benefits from the use of Digital Sequence Information on Genetic Resources (DSI)",47000]
[47702,"Cali Fund","Cali Fund For the Fair and Equitable Sharing of Benefits from the use of Digital Sequence Information on Genetic Resources (DSI)","Cali Fund","Cali Fund For the Fair and Equitable Sharing of Benefits from the use of Digital Sequence Information on Genetic Resources (DSI)",47000,"B03",null,null,47703,"KBF","Kunming Biodiversity Fund ","KBF","Kunming Biodiversity Fund ",47000]
[47703,"KBF","Kunming Biodiversity Fund","KBF","Kunming Biodiversity Fund",47000,"B03",null,null,47704,"SESRIC","SESRIC","SESRIC","SESRIC",47000,21]
[47704,"SESRIC","SESRIC","SESRIC","SESRIC",47000,"NULL",null,null,47705,"Interpol","Interpol","Interpol","Interpol",47000,22]
[47705,"Interpol","Interpol","Interpol","Interpol",47000,"NULL",null,null,47706,"EFSD","Eurasian Fund for Stabilization and Development","EFSD","Eurasian Fund for Stabilization and Development",47000,21]
[47706,"EFSD","Eurasian Fund for Stabilization and Development","EFSD","Eurasian Fund for Stabilization and Development",47000,"NULL",null,null,47707,null,"Arab Monetary Fund",null,"Arab Monetary Fund",47000]
[51000," ","University, college or other teaching institution, research institute or think-tank"," ","Université, collège ou autre établissement d'enseignement, institut de recherche ou de réflexion",51000,"NULL",null,null,47708,"CAN","Andean Community","CAN","Andean Community",47000]
[21004,"CODESRIA","Council for the Development of Economic and Social Research in Africa ","CODESRIA","Conseil pour le développement de la recherche en sciences sociales en Afrique",51000,"B01",null,null,47709,"CELAC","Community of Latin American and Caribbean States","CELAC","Community of Latin American and Caribbean States",47000]
[21009,"FARA","Forum for Agricultural Research in Africa ","FARA","Forum pour la recherche agricole en Afrique",51000,"B01",null,null,47710,null,"Pacific Alliance",null,"Pacific Alliance",47000]
[21021,"IIED","International Institute for Environment and Development ","IIED","Institut international pour l’environnement et le développement",51000,"B01",null,null,47711,"MERCOSUR","Southern Common Market","MERCOSUR","Southern Common Market",47000]
[21039,"IISD","International Institute for Sustainable Development","IIDD","Institut international de développement durable",51000,"B01",null,null,47712,"ATS","Antarctic Treaty Secretariat","ATS","Antartic Treaty Secretariat",47000]
[47008,"AVRDC","World Vegetable Centre","AVRDC","Centre international de cultures maraîchères",51000,"B01",null,null,51000," ","University, college or other teaching institution, research institute or think-tank"," ","University, college or other teaching institution, research institute or think-tank",51000]
[47017,"CIAT","International Centre for Tropical Agriculture ","CIAT","Centre international d'agriculture tropicale",51000,"B01",null,null,21004,"CODESRIA","Council for the Development of Economic and Social Research in Africa ","CODESRIA","Council for the Development of Economic and Social Research in Africa ",51000]
[47018,"CIFOR","Centre for International Forestry Research ","CIFOR","Centre de recherche forestière internationale ",51000,"B01",null,null,21009,"FARA","Forum for Agricultural Research in Africa ","FARA","Forum for Agricultural Research in Africa ",51000]
[47020,"CIMMYT","International Maize and Wheat Improvement Centre ","CIMMYT","Centre international d’amélioration du maïs et du blé ",51000,"B01",null,null,21021,"IIED","International Institute for Environment and Development ","IIED","International Institute for Environment and Development ",51000]
[47021,"CIP","International Potato Centre ","CIP","Centre international de la pomme de terre",51000,"B01",null,null,21039,"IISD","International Institute for Sustainable Development","IISD","International Institute for Sustainable Development",51000]
[47041,"FFTC","Food and Fertilizer Technology Centre ","FFTC","Centre des techniques de l'alimentation et des engrais",51000,"B01",null,null,47008,"AVRDC","World Vegetable Centre","AVRDC","World Vegetable Centre",51000]
[47047,"IAI","International African Institute ","IIA","Institut international africain",51000,"B01",null,null,47017,"CIAT","International Centre for Tropical Agriculture ","CIAT","International Centre for Tropical Agriculture ",51000]
[47051,"ICARDA","International Centre for Agricultural Research in Dry Areas ","ICARDA","Centre international de recherche agricole dans les zones arides",51000,"B01",null,null,47018,"CIFOR","Centre for International Forestry Research ","CIFOR","Centre for International Forestry Research ",51000]
[47053,"ICDDR,B","International Centre for Diarrhoeal Disease Research, Bangladesh","ICDDR,B","International Centre for Diarrhoeal Disease Research, Bangladesh",51000,"B01",null,null,47020,"CIMMYT","International Maize and Wheat Improvement Centre ","CIMMYT","International Maize and Wheat Improvement Centre ",51000]
[47054,"ICIPE","International Centre of Insect Physiology and Ecology ","ICIPE","Centre international sur la physiologie et l’écologie des insectes",51000,"B01",null,null,47021,"CIP","International Potato Centre ","CIP","International Potato Centre ",51000]
[47055,"ICRA","International Centre for Development Oriented Research in Agriculture ","ICRA","Centre International pour la Recherche Agricole orientée vers le développement",51000,"B01",null,null,47041,"FFTC","Food and Fertilizer Technology Centre ","FFTC","Food and Fertilizer Technology Centre ",51000]
[47056,"ICRAF","World AgroForestry Centre","ICRAF","Centre mondial de l’agroforesterie",51000,"B01",null,null,47047,"IAI","International African Institute ","IAI","International African Institute ",51000]
[47057,"ICRISAT","International Crop Research for Semi-Arid Tropics ","ICRISAT","Institut international de recherche sur les cultures des zones tropicales semi-arides",51000,"B01",null,null,47051,"ICARDA","International Centre for Agricultural Research in Dry Areas ","ICARDA","International Centre for Agricultural Research in Dry Areas ",51000]
[47062,"IITA","International Institute of Tropical Agriculture ","IITA","Institut international d’agriculture tropicale",51000,"B01",null,null,47053,"ICDDR,B","International Centre for Diarrhoeal Disease Research, Bangladesh","ICDDR,B","International Centre for Diarrhoeal Disease Research, Bangladesh",51000]
[47063,"ILRI","International Livestock Research Institute ","ILRI","International Livestock Research Institute",51000,"B01",null,null,47054,"ICIPE","International Centre of Insect Physiology and Ecology ","ICIPE","International Centre of Insect Physiology and Ecology ",51000]
[47069,"NULL","Bioversity International","NULL","Bioversity International",51000,"B01",null,null,47055,"ICRA","International Centre for Development Oriented Research in Agriculture ","ICRA","International Centre for Development Oriented Research in Agriculture ",51000]
[47070,"IRRI","International Rice Research Institute ","IIRR","Institut international de recherche sur le riz",51000,"B01",null,null,47056,"ICRAF","World AgroForestry Centre","ICRAF","World AgroForestry Centre",51000]
[47071,"ISTA","International Seed Testing Association ","ISTA","Association internationale d’essais de semences",51000,"B01",null,null,47057,"ICRISAT","International Crop Research for Semi-Arid Tropics ","ICRISAT","International Crop Research for Semi-Arid Tropics ",51000]
[47075,"IWMI","International Water Management Institute ","IWMI","Institut international de gestion des ressources en eau",51000,"B01",null,null,47062,"IITA","International Institute of Tropical Agriculture ","IITA","International Institute of Tropical Agriculture ",51000]
[47099,"USP","University of the South Pacific ","USP","Université du Pacifique Sud",51000,"B01",null,null,47063,"ILRI","International Livestock Research Institute ","ILRI","International Livestock Research Institute ",51000]
[47101,"WARDA","Africa Rice Centre","ADRAO","Centre du riz pour l’Afrique",51000,"B01",null,null,47069," ","Bioversity International"," ","Bioversity International",51000]
[47103,"WMU","World Maritime University ","UMM","Université maritime mondiale",51000,"B01",null,null,47070,"IRRI","International Rice Research Institute ","IRRI","International Rice Research Institute ",51000]
[47104,"WorldFish Centre","WorldFish Centre","WorldFish Centre","Centre international pour l’aménagement des ressources bioaquatiques",51000,"B01",null,null,47071,"ISTA","International Seed Testing Association ","ISTA","International Seed Testing Association ",51000]
[51001,"IFPRI","International Food Policy Research Institute","IFPRI","Institut International de Recherche sur les Politiques Alimentaires",51000,"B01",null,null,47075,"IWMI","International Water Management Institute ","IWMI","International Water Management Institute ",51000]
[60000," ","Private Sector Institutions"," ","Institutions du secteur privé",60000,"NULL",null,null,47099,"USP","University of the South Pacific ","USP","University of the South Pacific ",51000]
[61000," ","Private sector in provider country"," ","Secteur privé du pays donneur",60000,"NULL",null,null,47101,"WARDA","Africa Rice Centre","WARDA","Africa Rice Centre",51000]
[61001,"NULL","Banks (in provider country) (deposit taking corporations)","NULL","Banques (du pays donneur) (institutions de dépôts)",61000,"NULL",null,null,47103,"WMU","World Maritime University ","WMU","World Maritime University ",51000]
[61003,"NULL","Investment funds and other collective investment institutions (in provider country)","NULL","Fonds d’investissements et autres organismes de placement collectifs (du pays donneur)",61000,"NULL",null,null,47104,"WorldFish Centre","WorldFish Centre","WorldFish Centre","WorldFish Centre",51000]
[61004,"NULL","Holding companies, trusts and Special Purpose Vehicles (in provider country)","NULL","Sociétés holding, fonds fiduciaires et structures de titrisation",61000,"NULL",null,null,51001,"IFPRI","International Food Policy Research Institute","IFPRI","International Food Policy Research Institute",51000]
[61005,"NULL","Insurance Corporations (in provider country)","NULL","Sociétés d’assurance (du pays donneur)",61000,"NULL",null,null,60000," ","Private Sector Institutions"," ","Private Sector Institutions",60000]
[61006,"NULL","Pension Funds (in provider country)","NULL","Fonds de pension (du pays donneur)",61000,"NULL",null,null,61000," ","Private sector in provider country"," ","Private sector in provider country",60000]
[61007,"NULL","Other financial corporations (in provider country)","NULL","Autres sociétés financières (du pays donneur)",61000,"NULL",null,null,61001," ","Banks (deposit taking corporations)"," ","Banks (deposit taking corporations)",61000]
[61008,"NULL","Exporters (in provider country)","NULL","Exportateurs (du pays donneur)",61000,"NULL",null,null,61003," ","Investment funds and other collective investment institutions"," ","Investment funds and other collective investment institutions",61000]
[61009,"NULL","Other non-financial corporations (in provider country)","NULL","Autres sociétés non financières (du pays donneur)",61000,"NULL",null,null,61004," ","Holding companies, trusts and Special Purpose Vehicles"," ","Holding companies, trusts and Special Purpose Vehicles",61000]
[61010,"NULL","Retail investors (in provider country)","NULL","Investisseurs individuels (du pays donneur)",61000,"NULL",null,null,61005," ","Insurance Corporations"," ","Insurance Corporations",61000]
[62000," ","Private sector in recipient country"," ","Secteur privé du pays bénéficiaire",60000,"NULL",null,null,61006," ","Pension Funds"," ","Pension Funds",61000]
[62001,"NULL","Banks (in recipient country) (deposit taking corporations except Micro Finance Institutions)","NULL","Banques (du pays bénéficiaire) (institutions de dépôts hors institutions de microfinancement)",62000,"NULL",null,null,61007," ","Other financial corporations"," ","Other financial corporations",61000]
[62002,"NULL","Micro Finance Institutions (in recipient country) (deposit and non-deposit)","NULL","Institutions de microfinancement (du pays bénéficiaire) (collectant ou pas des dépôts)",62000,"NULL",null,null,61008," ","Exporters"," ","Exporters",61000]
[62003,"NULL","Investment funds and other collective investment institutions (in recipient country)","NULL","Fonds d’investissements et autres organismes de placement collectifs (du pays bénéficiaire)",62000,"NULL",null,null,61009," ","Other non-financial corporations"," ","Other non-financial corporations",61000]
[62004,"NULL","Holding companies, trusts and Special Purpose Vehicles (in recipient country)","NULL","Sociétés holding, fonds fiduciaires et structures de titrisation (du pays bénéficiaire)",62000,"NULL",null,null,61010," ","Retail investors"," ","Retail investors",61000]
[62005,"NULL","Insurance Corporations (in recipient country)","NULL","Sociétés d’assurance (du pays bénéficiaire)",62000,"NULL",null,null,62000," ","Private sector in recipient country"," ","Private sector in recipient country",60000]
[62006,"NULL","Pension Funds (in recipient country)","NULL","Fonds de pension (du pays bénéficiaire)",62000,"NULL",null,null,62001," ","Banks (deposit taking corporations except Micro Finance Institutions)"," ","Banks (deposit taking corporations except Micro Finance Institutions)",62000]
[62007,"NULL","Other financial corporations (in recipient country)","NULL","Autres sociétés financières (du pays bénéficiaire)",62000,"NULL",null,null,62002," ","Micro Finance Institutions (deposit and non-deposit)"," ","Micro Finance Institutions (deposit and non-deposit)",62000]
[62008,"NULL","Importers/Exporters","NULL","Importateurs / Exportateurs",62000,"NULL",null,null,62003," ","Investment funds and other collective investment institutions"," ","Investment funds and other collective investment institutions",62000]
[62009,"NULL","Other non-financial corporations (in recipient country)","NULL","Autres sociétés non financières (du pays bénéficiaire)",62000,"NULL",null,null,62004," ","Holding companies, trusts and Special Purpose Vehicles"," ","Holding companies, trusts and Special Purpose Vehicles",62000]
[62010,"NULL","Retail investors (in recipient country)","NULL","Investisseurs individuels (du pays bénéficiaire)",62000,"NULL",null,null,62005," ","Insurance Corporations"," ","Insurance Corporations",62000]
[63000," ","Private sector in third country"," ","Secteur privé d'un pays tiers",60000,"NULL",null,null,62006," ","Pension Funds"," ","Pension Funds",62000]
[63001,"NULL","Banks (in third country) (deposit taking corporations except Micro Finance Institutions)","NULL","Banques (d'un pays tiers) (institutions de dépôts hors institutions de microfinancement)",63000,"NULL",null,null,62007," ","Other financial corporations"," ","Other financial corporations",62000]
[63002,"NULL","Micro Finance Institutions (in third country) (deposit and non-deposit)","NULL","Institutions de microfinancement (d'un pays tiers) (collectant ou pas des dépôts)",63000,"NULL",null,null,62008," ","Importers/Exporters"," ","Importers/Exporters",62000]
[63003,"NULL","Investment funds and other collective investment institutions (in third country)","NULL","Fonds d’investissements et autres organismes de placement collectifs (d'un pays tiers)",63000,"NULL",null,null,62009," ","Other non-financial corporations"," ","Other non-financial corporations",62000]
[63004,"NULL","Holding companies, trusts and Special Purpose Vehicles (in third country)","NULL","Sociétés holding, fonds fiduciaires et structures de titrisation (d'un pays tiers)",63000,"NULL",null,null,62010," ","Retail investors"," ","Retail investors",62000]
[63005,"NULL","Insurance Corporations (in third country)","NULL","Sociétés d’assurance (d'un pays tiers)",63000,"NULL",null,null,63000," ","Private sector in third country"," ","Private sector in third country",60000]
[63006,"NULL","Pension Funds (in third country)","NULL","Fonds de pension (d'un pays tiers)",63000,"NULL",null,null,63001," ","Banks (deposit taking corporations except Micro Finance Institutions)"," ","Banks (deposit taking corporations except Micro Finance Institutions)",63000]
[63007,"NULL","Other financial corporations (in third country)","NULL","Autres sociétés financières (d'un pays tiers)",63000,"NULL",null,null,63002," ","Micro Finance Institutions (deposit and non-deposit)"," ","Micro Finance Institutions (deposit and non-deposit)",63000]
[63008,"NULL","Exporters (in third country)","NULL","Exportateurs (d'un pays tiers)",63000,"NULL",null,null,63003," ","Investment funds and other collective investment institutions"," ","Investment funds and other collective investment institutions",63000]
[63009,"NULL","Other non-financial corporations (in third country)","NULL","Autres sociétés non financières (d'un pays tiers)",63000,"NULL",null,null,63004," ","Holding companies, trusts and Special Purpose Vehicles"," ","Holding companies, trusts and Special Purpose Vehicles",63000]
[63010,"NULL","Retail investors (in third country)","NULL","Investisseurs individuels (d'un pays tiers)",63000,"NULL",null,null,63005," ","Insurance Corporations"," ","Insurance Corporations",63000]
[90000," ","Other"," ","Other",90000,"NULL",null,null,63006," ","Pension Funds"," ","Pension Funds",63000]
[null,null,null,null,null,null,null,null,null,63007," ","Other financial corporations"," ","Other financial corporations",63000]
[null,null,null,null,null,null,null,null,null,63008," ","Exporters"," ","Exporters",63000]
[null,null,null,null,null,null,null,null,null,63009," ","Other non-financial corporations"," ","Other non-financial corporations",63000]
[null,null,null,null,null,null,null,null,null,63010," ","Retail investors"," ","Retail investors",63000]
[null,null,null,null,null,null,null,null,null,90000," ","Other"," ","Other",90000]

{"sheet":"type_of_aid","index":8,"n_rows":108,"n_cols":5,"rows_kept":108,"cut":false,"hidden":true,"merged":[]}
["Aid_T","Aid_T_Description_E","Aid_T_Description_F","AidTDetailsE","AidTDetailsF"]
["A01","General budget support","Soutien budgétaire général","Unearmarked contributions to the government budget including funding to support the implementation of macroeconomic reforms (structural adjustment programmes, poverty reduction strategies). Budget support is a method of financing a recipient country’s budget through a transfer of resources from an external financing agency to the recipient government’s national treasury. The funds thus transferred are managed in accordance with the recipient’s budgetary procedures. Funds transferred to the national treasury for financing programmes or projects managed according to different budgetary procedures from those of the recipient country, with the intention of earmarking the resources for specific uses, are therefore excluded.","Contributions au budget du gouvernement non préaffectées y compris le soutien à la mise en œuvre de réformes macroéconomiques (programmes d’ajustement structurel, stratégies de lutte contre la pauvreté). Le soutien budgétaire se définit comme une méthode de financement du budget d’un pays bénéficiaire via un transfert de ressources d’un organisme de financement externe au Trésor public du gouvernement bénéficiaire. Les fonds ainsi transférés sont gérés conformément aux procédures budgétaires du bénéficiaire. Cette définition n’englobe donc pas les fonds transférés au Trésor public pour le financement de programmes ou de projets gérés selon des procédures budgétaires différentes de celles du pays bénéficiaire, dans l’intention d’affecter ces ressources à des usages spécifiques."]
["A02","Sector budget support","Soutien budgétaire sectoriel","Sector budget support, like general budget support, is a financial contribution to a recipient government’s budget.  However, in sector budget support, the dialogue between donors and partner governments focuses on sector-specific concerns, rather than on overall policy and budget priorities.","Le soutien budgétaire sectoriel, comme le soutien budgétaire général, est une contribution financière au budget du gouvernement du pays bénéficiaire. Cependant, dans le cas du soutien budgétaire sectoriel, le dialogue entre les donneurs et les gouvernements partenaires se concentre sur les préoccupations spécifiques à un secteur plutôt que sur les priorités de la politique globale et les priorités budgétaires."]
["B01","Core support to NGOs, other private bodies, PPPs and research institutes","Contributions aux budgets réguliers des ONG, autres organismes privés, partenariats public-privé (PPP) et instituts de recherche","Funds are paid over to NGOs (local, national and international) for use at the latter’s discretion, and contribute to programmes and activities which NGOs have developed themselves, and which they implement on their own authority and responsibility. Core contributions to PPPs, funds paid over to foundations (e.g. philanthropic foundations), and contributions to research institutes (public and private) are also recorded here. Annex 2 of the DAC Directives provides a list of INGOs, PPPs and networks core contributions to which may be reported under B01. This list is not exclusive. ","Fonds versés à des PPP, réseaux, instituts de recherche et organismes privés à but non lucratif – ONG basées dans des pays en développement, dans des pays donneurs ou ONG internationales et autres organisations de la société civile par exemple les fondations philanthropiques – qui sont utilisés à la discrétion de ces organisations, et qui contribuent au financement de programmes et activités que ces organisations ont mis au point elles-mêmes et qu’elles mettent en œuvre sous leur propre autorité et responsabilité.La Liste des organisations internationales éligible en APD (voir l’annexe 2) fournit une liste d’ONGI, de PPP et de réseaux en faveur desquels les contributions aux budgets réguliers peuvent être notifiées sous B01. Cette liste n’est pas exhaustive."]
["B02","Core contributions to multilateral institutions","Contributions aux budgets réguliers des institutions multilatérales","These funds are classified as multilateral ODA (all other categories fall under bilateral ODA). The recipient multilateral institution pools contributions so that they lose their identity and become an integral part of its financial assets. See Annex 2 of the DAC Directives for a comprehensive list of agencies core contributions to which may be reported under B02 (Section I. Multilateral institutions).","Ces fonds sont comptabilisés en tant qu’APD multilatérale (toutes les autres catégories font partie de l’aide bilatérale). L’organisation internationale bénéficiaire fusionne les contributions, qui deviennent anonymes et font alors partie intégrante de ses avoirs financiers.La Liste des organisations internationales éligible en APD (voir l’annexe 2) fournit une liste complète des organisations en faveur desquelles les contributions aux budgets réguliers peuvent être notifiées sous B02."]
["B021","Core contributions to multilateral institutions","Contributions in this category are pooled by the recipient multilateral institution and become an integral part of its financial assets or liabilities.","Contributions aux budgets réguliers des institutions multilatérales","Les contributions de cette catégorie sont mises en commun par l'institution multilatérale bénéficiaire et deviennent partie intégrante de ses actifs ou passifs financiers."]
["B022","Core contributions to global funds","Contributions to global funds classified as multilateral including Financial Intermediary Funds for which the World Bank is the Trustee and which have gone through the Annex 2 process (GEF, CIFs) as well as some UN inter-agency pooled funds, e.g. CERF and the UN Peacebuilding Fund.","Contributions de base aux fonds mondiaux","Contributions à des fonds mondiaux classés comme multilatéraux, y compris les fonds d'intermédiation financière dont la Banque mondiale est l'administrateur et qui sont passés par le processus de l'annexe 2 (FEM, FIC), ainsi que certains fonds communs inter-institutions des Nations unies, par exemple le CERF et le Fonds de consolidation de la paix des Nations unies."]
["B03","Contributions to specific-purpose programmes and funds managed by international organisations (multilateral, INGO)","Contributions à des programmes ou fonds à objectif spécifique gérés par des organisations internationales (multilatérales, ONGI)","In addition to their core-funded operations, international organisations set up and raise funds for specific programmes and funds with clearly identified sectoral, thematic or geographical focus. Donors’ bilateral contributions to such programmes and funds are recorded here, e.g. “UNICEF girls’ education”, “Education For All Fast Track Initiative”, various trust funds, including for reconstruction (e.g. Afghanistan Reconstruction Trust Fund).","Outre leurs opérations de base, les organisations internationales mettent en place et lèvent des financements pour des programmes ou fonds qui visent des objectifs sectoriels, thématiques ou géographiques spécifiques. Les contributions des donneurs à ce type de programmes et fonds entrent dans cette catégorie, par exemple celles destinées au « Réseau pour l’éducation des femmes et des filles » parrainé par l’UNICEF, à l’« Initiative pour la mise en œuvre accélérée du programme d’éducation pour tous », ou à divers fonds d’affectation spéciale, y compris pour la reconstruction (par exemple le Fonds d’affectation spéciale pour la reconstruction de l’Afghanistan - ARTF)."]
["B031","Contributions to multi-donor/multi-entity funding mechanisms","Contributions to funding mechanisms (specific-purpose programmes and funds) that pool resources from several providers and from which several international organisations – multilateral agencies, NGOs, PPPs or networks – may be allocated funds for implementation e.g. contributions to UN country-based pooled funds and country-level development funds. Excludes contributions to global funds classified as multilateral (see B022). Includes Financial Intermediary Funds for which the World Bank is the Trustee and which have not gone through the Annex 2 process.","Contributions aux mécanismes de financement multi-donateurs / multi-entités","Contributions à des mécanismes de financement (programmes et fonds à finalité spécifique) qui mettent en commun les ressources de plusieurs fournisseurs et à partir desquels plusieurs agences multilatérales –  agences multilatérales, ONG, PPP et réseaux – peuvent se voir allouer des fonds pour la mise en œuvre ; contributions à des fonds communs par pays des Nations unies et à des fonds de développement au niveau des pays. Ne comprend pas les contributions aux fonds mondiaux classés comme multilatéraux (voir B022). Comprend les fonds intermédiaires financiers dont la Banque mondiale est l'administrateur et qui ne sont pas passés par le processus de l'annexe 2."]
["B032","Contributions to multi-donor/single-entity funding mechanisms","Contributions to multi-donor funding mechanisms (specific-purpose programmes and funds) managed by a single international organisation – multilateral agency, NGO, PPP or network – e.g. UN single-agency thematic funds; World Bank or other MDB trust funds. Classify the contribution as B032 even if in the initial stages only one donor contributes to the fund.","Contributions aux mécanismes de financement multi-donateurs / entité unique","Contributions à des mécanismes de financement multi-donateurs (programmes et fonds à but spécial) gérés par une seule organisation multilatérale  –  agences multilatérales, ONG, PPP et réseaux – , par exemple, les fonds thématiques d'une seule agence des Nations Unies ; les fonds fiduciaires de la Banque mondiale ou d'autres BMD. Classer la contribution sous B032 même si un seul donateur contribue initialement au fonds."]
["B033","Contributions to single-donor funding mechanisms and contributions earmarked for a specific funding window or geographical location","Contributions to funding mechanisms (specific-purpose programmes and funds) where the donor has a significant influence on the allocation of funds. This includes contributions to single-donor trust funds and earmarked contributions to specific countries/geographical locations or funding windows within multi-donor trust funds. When the donor designs the activity but channels it through an international organisation, the activity should be classified as C01.","Contributions aux mécanismes de financement à un seul donateur et contributions affectées à un guichet de financement ou à un emplacement géographique","Contributions aux mécanismes de financement (programmes et fonds à but spécifique) où le donateur a une influence significative sur l'allocation des fonds. Cela comprend les contributions à des fonds d'affectation spéciale à donateur unique et les contributions affectées à des pays/emplacements géographiques spécifiques ou à des guichets de financement au sein de fonds d'affectation spéciale à donateur multiple. Lorsque le donateur conçoit l'activité mais la fait transiter par une organisation internationale, l'activité doit être classée en C01."]
["B04","Basket funds/pooled funding","Fonds communs/financements groupés","The donor contributes funds to an autonomous account, managed jointly with other donors and/or the recipient. The account will have specific purposes, modes of disbursement and accountability mechanisms, and a limited time frame. Basket funds are characterised by common project documents, common funding contracts and common reporting/audit procedures with all donors. Donors’ contributions to funds managed autonomously by international organisations are recorded under B03.","Le donneur dépose des fonds sur un compte autonome, géré conjointement avec d’autres donneurs et/ou le bénéficiaire. Sont associés à ce compte des objectifs, des modalités de versement, des mécanismes de reddition de comptes spécifiques, et un horizon temporel précis.La mise en commun de fonds suppose des documents de projet communs, des contrats de financement communs et des procédures de notification/audit communes à tous les donneurs.Les contributions des donneurs à des fonds gérés par des organisations internationales sont notifiées sous B03."]
["C01","Project-type interventions","Interventions de type projet","A project is a set of inputs, activities and outputs, agreed with the partner country*, to reach specific objectives/outcomes within a defined time frame, with a defined budget and a defined geographical area. Projects can vary significantly in terms of objectives, complexity, amounts involved and duration. There are smaller projects that might involve modest financial resources and last only a few months, whereas large projects might involve more significant amounts, entail successive phases and last for many years. A large project with a number of different components is sometimes referred to as a programme, but should nevertheless be recorded here.  Feasibility studies, appraisals and evaluations are included (whether designed as part of projects/programmes or dedicated funding arrangements).Aid channelled through NGOs or multilaterals is also recorded here. This includes payments for NGOs and multilaterals to implement donors’ projects and programmes, and funding of specified NGOs projects. By contrast, core funding of NGOs and multilaterals as well as contributions to specific-purpose funds managed by international organisations are recorded under B. * In the cases of equity investments, humanitarian aid or aid channelled through NGOs, projects are recorded here even if there was no direct agreement between the donor and the partner country.  ","Un projet est un ensemble d’éléments, d’activités et de produits, convenus avec le pays partenaire*, en vue d’atteindre des objectifs/résultats spécifiques dans un laps de temps et une zone géographique prédéfinis au moyen d’un budget fixé à l’avance. Les projets peuvent différer considérablement par leurs objectifs, leur complexité, les montants en jeu et leur durée. Si les petits projets ne mettent en jeu que des ressources financières modestes et ne durent souvent que quelques mois, les grands projets peuvent porter sur des montants substantiels, devoir être mis en œuvre par tranches et durer plusieurs années. Lorsqu’un grand projet se subdivise en plusieurs composantes, il est parfois appelé programme, mais doit néanmoins être comptabilisé dans la présente rubrique.  Sont inclues les études de faisabilité, ainsi que les évaluations préalables ou  rétrospectives (qu’elles soient conçues comme un volet du projet/programme ou qu’elles fassent l’objet de modalités de financement dédiées).L’aide acheminée par l’intermédiaire d’ONG ou d’organisations multilatérales est également notifiée ici. Cela comprend les paiements effectués aux ONG et aux organisations multilatérales pour qu’elles mettent en œuvre les projets et programmes des donneurs, ainsi que le financement de projets spécifiques des ONG. En revanche, les contributions de caractère général aux ONG et aux organisations multilatérales ainsi que les contributions aux fonds à objectif spécifique gérés par des organisations internationales sont notifiées sous B. * Dans le cas d’investissements sous forme de prises de participation, d’une aide humanitaire ou d’une aide par l’intermédiaire d’ONG, les projets sont notifiés ici même s’ils ne font pas l’objet d’un accord direct avec le pays partenaire."]
["D01","Donor country personnel","Personnel du pays donneur","Experts, consultants, teachers, academics, researchers, volunteers and contributions to public and private bodies for sending experts to developing countries.","Experts, consultants, enseignants, universitaires, chercheurs, stagiaires et volontaires, ainsi que contributions à des organismes publics et privés pour l’envoi d’experts dans les pays en développement. "]
["D02","Other technical assistance","Autres formes d’assistance technique ","Provision, outside projects as described in category C01, of technical assistance in recipient countries (excluding technical assistance performed by donor experts reported under D01, and scholarships/training in donor country reported under E01). This includes training and research; language training; south-south studies; research studies; collaborative research between donor and recipient universities and organisations); local scholarships; development-oriented social and cultural programmes. This category also covers ad hoc contributions such as conferences, seminars and workshops, exchange visits, publications, etc.","Cette catégorie couvre l’apport de savoir-faire en dehors de projets tels qu’ils sont définis dans la catégorie C01 (sauf l’assistance technique fournie par des experts des pays donneurs couverte sous D01, et les bourses/formations dans le pays donneur couvertes sous E01.) Sont inclues les activités de formation et de recherche, les formations linguistiques, les études Sud-Sud, les études pour la recherche, les activités de recherche impliquant une collaboration entre des universités ou organismes du pays donneur et du pays bénéficiaire, les bourses locales, et les programmes sociaux et culturels à des fins de développement. La catégorie couvre également les contributions ponctuelles telles les conférences, séminaires et ateliers, échanges, publications, etc."]
["E01","Scholarships/training in donor country","Bourses/formations dans le pays donneur","Financial aid awards for individual students and contributions to trainees.","Bourses octroyées à des étudiants et contributions aux frais associés à des stages."]
["E02","Imputed student costs","Coûts imputés des étudiants","Indirect (“imputed”) costs of tuition in donor countries.","Coûts indirects (“imputés”) correspondant aux frais de scolarité dans le pays donneur."]
["F01","Debt relief","Allégement de la dette","Groups all actions relating to debt (forgiveness, conversions, swaps, buy-backs, rescheduling, refinancing).","Regroupe toutes les actions se rapportant à la dette (annulation, conversion, échange, rachat, rééchelonnement, refinancement)."]
["G01","Administrative costs not included elsewhere","Frais administratifs non inclus ailleurs","Administrative costs of development assistance programmes not already included under other ODA items as an integral part of the costs of delivering or implementing the aid provided. This category covers situation analyses and auditing activities.As regards the salaries component of administrative costs, it relates to  in-house agency staff and contractors only; costs associated with donor experts/consultants are to be reported under category C or D01.","Frais d'administration des programmes d'aide au développement qui ne sont pas déjà inclus dans d'autres rubriques comme partie intégrante du coût de l’acheminement ou de la mise en œuvre de l’aide fournie. Cette catégorie comprend les analyses de situation et les activités d’audit.En ce qui concerne la composante salariale des frais administratifs, elle se rapporte uniquement au personnel et contractuels de l’agence ; les coûts associés aux experts/consultants du pays donneur sont à notifier sous les catégories C ou D01."]
["H01","Development awareness","Sensibilisation au développement ","Funding of activities designed to increase public support, i.e. awareness in the donor country of development co-operation efforts, needs and issues.","Financement d’activités visant à accroître le soutien du public dans le pays donneur pour les efforts de coopération pour le développement et à rendre la population plus consciente des besoins et problèmes du développement."]
["H02","Refugees/asylum seekers in donor countries","Refugiés/demandeurs d’asile dans les pays donneurs","Costs incurred in donor countries for basic assistance to asylum seekers and refugees from developing countries, up to 12 months, when costs cannot be disaggregated. See section II.6 and Annex 17.  ","Coûts encourus dans les pays donneurs au titre de l’aide de base apportée aux demandeurs d’asile et aux réfugiés en provenance des pays en développement pendant une période pouvant aller jusqu’à 12 mois, quand les coûts ne peuvent pas être désagrégés. Voir section II.6 et Annexe 17."]
["H03","Asylum-seekers ultimately accepted","Demandeurs d’asile finalement acceptés","Costs incurred in donor countries for basic assistance to asylum seekers, when these are ultimately accepted. This category includes only costs incurred prior to recognition.","Coûts encourus dans les pays donneurs au titre de l’aide de base apportée aux demandeurs d’asile lorsque ceux-ci sont finalement acceptés. Cette catégorie couvre uniquement les coûts encourus avant la reconnaissance de statut."]
["H04","Asylum-seekers ultimately rejected","Demandeurs d’asile finalement déboutés","Costs incurred in donor countries for basic assistance to asylum seekers, when these are ultimately rejected. This category includes only costs incurred prior to rejection. Members may base their reporting on the first instance rejection, where a final decision on status is anticipated to occur after a 12-month period, and this facilitates the establishment of a conservative estimate. For further guidance on how to proceed with calculating costs related to rejected asylum seekers, see Clarification 5, third bullet in section II.6 of the Reporting Directives.","Coûts encourus dans les pays donneurs au titre de l’aide de base apportée aux demandeurs d’asile lorsque ceux-ci sont finalement déboutés. Cette catégorie couvre uniquement les coûts encourus avant le rejet de la demande. Dans les cas où il est probable que la décision définitive relative au statut ne surviendra qu’après douze mois et afin de parvenir à une estimation prudente, les membres peuvent établir leur notification en fonction de la date du rejet en première instance. Pour plus d’instructions sur la façon de calculer les coûts relatifs aux demandeurs d’asile finalement déboutés, voir la Clarification 5, troisième point dans la section II.6 des Directives."]
["H05","Recognised refugees","Personnes auxquelles le statut de réfugié a été accordé","Costs incurred in donor countries for basic assistance to refugees with a recognised status. This category only includes costs after recognition (or after date of entry into a country through a resettlement programme).","Coûts encourus dans les pays donneurs au titre de l’aide de base apportée aux personnes auxquelles le statut de réfugié a été accordé. Cette catégorie couvre uniquement les coûts postérieurs à la reconnaissance (ou à la date d’entrée dans un pays dans le cadre d’un programme de réinstallation)."]
["H06","Refugees and asylum seekers in other provider countries"]
["A00","Budget support","Identifies contributions from the provider to the government budget of a recipient country, which has exclusive responsibility for the use of and accountability for the funds. Budget support can be generic (not sector allocated) or sectoral (e.g. energy, agriculture)."]
["B01","Core support to NGOs, other private bodies, PPPs and research institutes","Contributions aux budgets réguliers des ONG, autres organismes privés, partenariats public-privé (PPP) et instituts de recherche","Funds are paid over to NGOs (local, national and international) for use at the latter’s discretion, and contribute to programmes and activities which NGOs have developed themselves, and which they implement on their own authority and responsibility. Core contributions to PPPs, funds paid over to foundations (e.g. philanthropic foundations), and contributions to research institutes (public and private) are also recorded here. Annex 2 of the DAC Directives provides a list of INGOs, PPPs and networks core contributions to which may be reported under B01. This list is not exclusive. ","Fonds versés à des PPP, réseaux, instituts de recherche et organismes privés à but non lucratif – ONG basées dans des pays en développement, dans des pays donneurs ou ONG internationales et autres organisations de la société civile par exemple les fondations philanthropiques – qui sont utilisés à la discrétion de ces organisations, et qui contribuent au financement de programmes et activités que ces organisations ont mis au point elles-mêmes et qu’elles mettent en œuvre sous leur propre autorité et responsabilité.La Liste des organisations internationales éligible en APD (voir l’annexe 2) fournit une liste d’ONGI, de PPP et de réseaux en faveur desquels les contributions aux budgets réguliers peuvent être notifiées sous B01. Cette liste n’est pas exhaustive."]
["B02","Core contributions to multilateral institutions","Contributions aux budgets réguliers des institutions multilatérales","These funds are classified as multilateral ODA (all other categories fall under bilateral ODA). The recipient multilateral institution pools contributions so that they lose their identity and become an integral part of its financial assets. See Annex 2 of the DAC Directives for a comprehensive list of agencies core contributions to which may be reported under B02 (Section I. Multilateral institutions).","Ces fonds sont comptabilisés en tant qu’APD multilatérale (toutes les autres catégories font partie de l’aide bilatérale). L’organisation internationale bénéficiaire fusionne les contributions, qui deviennent anonymes et font alors partie intégrante de ses avoirs financiers.La Liste des organisations internationales éligible en APD (voir l’annexe 2) fournit une liste complète des organisations en faveur desquelles les contributions aux budgets réguliers peuvent être notifiées sous B02."]
["B02a","Assessed contributions to multilateral institutions"]
["B02b","Voluntary core contributions to multilateral institutions"]
["B03","Contributions to specific-purpose programmes and funds managed by international organisations (multilateral, INGO)","Contributions à des programmes ou fonds à objectif spécifique gérés par des organisations internationales (multilatérales, ONGI)","In addition to their core-funded operations, international organisations set up and raise funds for specific programmes and funds with clearly identified sectoral, thematic or geographical focus. Donors’ bilateral contributions to such programmes and funds are recorded here, e.g. “UNICEF girls’ education”, “Education For All Fast Track Initiative”, various trust funds, including for reconstruction (e.g. Afghanistan Reconstruction Trust Fund).","Outre leurs opérations de base, les organisations internationales mettent en place et lèvent des financements pour des programmes ou fonds qui visent des objectifs sectoriels, thématiques ou géographiques spécifiques. Les contributions des donneurs à ce type de programmes et fonds entrent dans cette catégorie, par exemple celles destinées au « Réseau pour l’éducation des femmes et des filles » parrainé par l’UNICEF, à l’« Initiative pour la mise en œuvre accélérée du programme d’éducation pour tous », ou à divers fonds d’affectation spéciale, y compris pour la reconstruction (par exemple le Fonds d’affectation spéciale pour la reconstruction de l’Afghanistan - ARTF)."]
["B04","Basket funds/pooled funding","Fonds communs/financements groupés","The donor contributes funds to an autonomous account, managed jointly with other donors and/or the recipient. The account will have specific purposes, modes of disbursement and accountability mechanisms, and a limited time frame. Basket funds are characterised by common project documents, common funding contracts and common reporting/audit procedures with all donors. Donors’ contributions to funds managed autonomously by international organisations are recorded under B03.","Le donneur dépose des fonds sur un compte autonome, géré conjointement avec d’autres donneurs et/ou le bénéficiaire. Sont associés à ce compte des objectifs, des modalités de versement, des mécanismes de reddition de comptes spécifiques, et un horizon temporel précis.La mise en commun de fonds suppose des documents de projet communs, des contrats de financement communs et des procédures de notification/audit communes à tous les donneurs.Les contributions des donneurs à des fonds gérés par des organisations internationales sont notifiées sous B03."]
["C01","Projects","Identifies specific inputs, activities and outputs supported by a TOSSD provider, to reach specific objectives/outcomes within a defined time frame, with a defined budget and a defined geographical area."]
["D01","In-kind technical co-operation experts","Identifies technical co-operation implemented using public officials of the reporting country. Technical co-operation already embedded in the projects described above is not included, nor are experts hired on the market."]
["D02","Other technical co-operation","Includes the provision of technical  co-operation using internationally or locally recruited experts, beyond technical co-operation already embedded in the projects described above and beyond in-kind technical co-operation. All non-salary costs of experts (including those of public officials of the reporting country) such as flights, per-diem, accommodation, internal transportation within the recipient country and training, are also included. This category also covers training and research as well as various capacity building activities such as conferences, seminars, workshops, exchange visits."]
["E01","Scholarships/training in donor country","Reportable under Pillar I."]
["E02","Imputed student costs","Reportable under Pillar II."]
["F01","Debt relief - principal (original loan previously recorded in TOSSD)","Principal component of a debt relief operation, in cases where the loans concerned were previously recorded in TOSSD. The amount of principal will be automatically offset from the TOSSD gross and net measures, to avoid double counting."]
["F02","Debt relief - principal (original loan not recorded in TOSSD)","Principal component of a debt relief operation, in cases where the loans concerned were not previously recorded in TOSSD (private claims or official claims not previously recorded in TOSSD). "]
["F03","Debt relief - interest","Interest component of a debt relief operation (interests in arrears and late interests). "]
["G01","Administrative costs not included elsewhere","Includes administrative costs of delivering TOSSD activities (not included elsewhere). When the exact amount cannot be identified, reporters may estimate these costs as follows: i) take as a starting point the total administrative costs of development co-operation agencies and other official entities involved in the delivery of TOSSD activities; and ii) do a pro-rata calculation, reflecting the share of TOSSD-eligible activities and countries in total expenditures of the institution. Administrative costs are included in Pillar II, but the costs of country or regional offices may be reported against the code of the country or region in which the activities are conducted."]
["H00","Expenditures in the provider country","Expenditures in the provider country not included elsewhere."]
["I01","Support to refugees/protected persons in the provider country (up to 12 months of their stay) ","Costs incurred in provider countries for basic assistance to asylum seekers, refugees and protected persons from TOSSD-eligible countries, up to 12 months. Reportable under Pillar II."]
["I02","Support to refugees/protected persons in the provider country (beyond the 12-month period)","Costs incurred in provider countries for basic assistance to asylum seekers, refugees and protected persons from TOSSD-eligible countries, beyond the 12-month period, to the extent that the individual is not recognised by the competent authorities of the country in which he/she has sought asylum as having the rights and obligations which are attached to the possession of residency or nationality of that country. Reportable under Pillar II."]
["I05","Support to refugees/protected persons/migrants for their integration in the economy of provider countries","Costs incurred in provider countries for promoting the integration in their economy of asylum seekers, refugees, protected persons and migrants from TOSSD-eligible countries. Covers activities that promote the integration in the economy and culture of the provider country (including language training, vocational training, social protection schemes, employment programmes, awareness on national culture), up to the first 5 years of stay. Temporary sustenance/basic assistance is covered under modalities I01 and I02. Reportable under Pillar II."]
["K02","RESEARCH AND DEVELOPMENT (R&D)","Research and experimental development comprising creative and systematic work undertaken in order to increase the stock of knowledge – including knowledge of humankind, culture and society – and to devise new applications of available knowledge."]
["J01","In-kind donation of goods"]
[]
["Aid_T","Aid_T_Description_E","Aid_T_Description_F","AidTDetailsE","AidTDetailsF"]
["A01","General budget support","Soutien budgétaire général","Unearmarked contributions to the government budget including funding to support the implementation of macroeconomic reforms (structural adjustment programmes, poverty reduction strategies). Budget support is a method of financing a recipient country’s budget through a transfer of resources from an external financing agency to the recipient government’s national treasury. The funds thus transferred are managed in accordance with the recipient’s budgetary procedures. Funds transferred to the national treasury for financing programmes or projects managed according to different budgetary procedures from those of the recipient country, with the intention of earmarking the resources for specific uses, are therefore excluded.","Contributions au budget du gouvernement non préaffectées y compris le soutien à la mise en œuvre de réformes macroéconomiques (programmes d’ajustement structurel, stratégies de lutte contre la pauvreté). Le soutien budgétaire se définit comme une méthode de financement du budget d’un pays bénéficiaire via un transfert de ressources d’un organisme de financement externe au Trésor public du gouvernement bénéficiaire. Les fonds ainsi transférés sont gérés conformément aux procédures budgétaires du bénéficiaire. Cette définition n’englobe donc pas les fonds transférés au Trésor public pour le financement de programmes ou de projets gérés selon des procédures budgétaires différentes de celles du pays bénéficiaire, dans l’intention d’affecter ces ressources à des usages spécifiques."]
["A02","Sector budget support","Soutien budgétaire sectoriel","Sector budget support, like general budget support, is a financial contribution to a recipient government’s budget.  However, in sector budget support, the dialogue between donors and partner governments focuses on sector-specific concerns, rather than on overall policy and budget priorities.","Le soutien budgétaire sectoriel, comme le soutien budgétaire général, est une contribution financière au budget du gouvernement du pays bénéficiaire. Cependant, dans le cas du soutien budgétaire sectoriel, le dialogue entre les donneurs et les gouvernements partenaires se concentre sur les préoccupations spécifiques à un secteur plutôt que sur les priorités de la politique globale et les priorités budgétaires."]
["B01","Core support to NGOs, other private bodies, PPPs and research institutes","Contributions aux budgets réguliers des ONG, autres organismes privés, partenariats public-privé (PPP) et instituts de recherche","Funds are paid over to NGOs (local, national and international) for use at the latter’s discretion, and contribute to programmes and activities which NGOs have developed themselves, and which they implement on their own authority and responsibility. Core contributions to PPPs, funds paid over to foundations (e.g. philanthropic foundations), and contributions to research institutes (public and private) are also recorded here. Annex 2 of the DAC Directives provides a list of INGOs, PPPs and networks core contributions to which may be reported under B01. This list is not exclusive. ","Fonds versés à des PPP, réseaux, instituts de recherche et organismes privés à but non lucratif – ONG basées dans des pays en développement, dans des pays donneurs ou ONG internationales et autres organisations de la société civile par exemple les fondations philanthropiques – qui sont utilisés à la discrétion de ces organisations, et qui contribuent au financement de programmes et activités que ces organisations ont mis au point elles-mêmes et qu’elles mettent en œuvre sous leur propre autorité et responsabilité.La Liste des organisations internationales éligible en APD (voir l’annexe 2) fournit une liste d’ONGI, de PPP et de réseaux en faveur desquels les contributions aux budgets réguliers peuvent être notifiées sous B01. Cette liste n’est pas exhaustive."]
["B02","Core contributions to multilateral institutions","Contributions aux budgets réguliers des institutions multilatérales","These funds are classified as multilateral ODA (all other categories fall under bilateral ODA). The recipient multilateral institution pools contributions so that they lose their identity and become an integral part of its financial assets. See Annex 2 of the DAC Directives for a comprehensive list of agencies core contributions to which may be reported under B02 (Section I. Multilateral institutions).","Ces fonds sont comptabilisés en tant qu’APD multilatérale (toutes les autres catégories font partie de l’aide bilatérale). L’organisation internationale bénéficiaire fusionne les contributions, qui deviennent anonymes et font alors partie intégrante de ses avoirs financiers.La Liste des organisations internationales éligible en APD (voir l’annexe 2) fournit une liste complète des organisations en faveur desquelles les contributions aux budgets réguliers peuvent être notifiées sous B02."]
["B021","Core contributions to multilateral institutions","Contributions in this category are pooled by the recipient multilateral institution and become an integral part of its financial assets or liabilities.","Contributions aux budgets réguliers des institutions multilatérales","Les contributions de cette catégorie sont mises en commun par l'institution multilatérale bénéficiaire et deviennent partie intégrante de ses actifs ou passifs financiers."]
["B022","Core contributions to global funds","Contributions to global funds classified as multilateral including Financial Intermediary Funds for which the World Bank is the Trustee and which have gone through the Annex 2 process (GEF, CIFs) as well as some UN inter-agency pooled funds, e.g. CERF and the UN Peacebuilding Fund.","Contributions de base aux fonds mondiaux","Contributions à des fonds mondiaux classés comme multilatéraux, y compris les fonds d'intermédiation financière dont la Banque mondiale est l'administrateur et qui sont passés par le processus de l'annexe 2 (FEM, FIC), ainsi que certains fonds communs inter-institutions des Nations unies, par exemple le CERF et le Fonds de consolidation de la paix des Nations unies."]
["B03","Contributions to specific-purpose programmes and funds managed by international organisations (multilateral, INGO)","Contributions à des programmes ou fonds à objectif spécifique gérés par des organisations internationales (multilatérales, ONGI)","In addition to their core-funded operations, international organisations set up and raise funds for specific programmes and funds with clearly identified sectoral, thematic or geographical focus. Donors’ bilateral contributions to such programmes and funds are recorded here, e.g. “UNICEF girls’ education”, “Education For All Fast Track Initiative”, various trust funds, including for reconstruction (e.g. Afghanistan Reconstruction Trust Fund).","Outre leurs opérations de base, les organisations internationales mettent en place et lèvent des financements pour des programmes ou fonds qui visent des objectifs sectoriels, thématiques ou géographiques spécifiques. Les contributions des donneurs à ce type de programmes et fonds entrent dans cette catégorie, par exemple celles destinées au « Réseau pour l’éducation des femmes et des filles » parrainé par l’UNICEF, à l’« Initiative pour la mise en œuvre accélérée du programme d’éducation pour tous », ou à divers fonds d’affectation spéciale, y compris pour la reconstruction (par exemple le Fonds d’affectation spéciale pour la reconstruction de l’Afghanistan - ARTF)."]
["B031","Contributions to multi-donor/multi-entity funding mechanisms","Contributions to funding mechanisms (specific-purpose programmes and funds) that pool resources from several providers and from which several international organisations – multilateral agencies, NGOs, PPPs or networks – may be allocated funds for implementation e.g. contributions to UN country-based pooled funds and country-level development funds. Excludes contributions to global funds classified as multilateral (see B022). Includes Financial Intermediary Funds for which the World Bank is the Trustee and which have not gone through the Annex 2 process.","Contributions aux mécanismes de financement multi-donateurs / multi-entités","Contributions à des mécanismes de financement (programmes et fonds à finalité spécifique) qui mettent en commun les ressources de plusieurs fournisseurs et à partir desquels plusieurs agences multilatérales –  agences multilatérales, ONG, PPP et réseaux – peuvent se voir allouer des fonds pour la mise en œuvre ; contributions à des fonds communs par pays des Nations unies et à des fonds de développement au niveau des pays. Ne comprend pas les contributions aux fonds mondiaux classés comme multilatéraux (voir B022). Comprend les fonds intermédiaires financiers dont la Banque mondiale est l'administrateur et qui ne sont pas passés par le processus de l'annexe 2."]
["B032","Contributions to multi-donor/single-entity funding mechanisms","Contributions to multi-donor funding mechanisms (specific-purpose programmes and funds) managed by a single international organisation – multilateral agency, NGO, PPP or network – e.g. UN single-agency thematic funds; World Bank or other MDB trust funds. Classify the contribution as B032 even if in the initial stages only one donor contributes to the fund.","Contributions aux mécanismes de financement multi-donateurs / entité unique","Contributions à des mécanismes de financement multi-donateurs (programmes et fonds à but spécial) gérés par une seule organisation multilatérale  –  agences multilatérales, ONG, PPP et réseaux – , par exemple, les fonds thématiques d'une seule agence des Nations Unies ; les fonds fiduciaires de la Banque mondiale ou d'autres BMD. Classer la contribution sous B032 même si un seul donateur contribue initialement au fonds."]
["B033","Contributions to single-donor funding mechanisms and contributions earmarked for a specific funding window or geographical location","Contributions to funding mechanisms (specific-purpose programmes and funds) where the donor has a significant influence on the allocation of funds. This includes contributions to single-donor trust funds and earmarked contributions to specific countries/geographical locations or funding windows within multi-donor trust funds. When the donor designs the activity but channels it through an international organisation, the activity should be classified as C01.","Contributions aux mécanismes de financement à un seul donateur et contributions affectées à un guichet de financement ou à un emplacement géographique","Contributions aux mécanismes de financement (programmes et fonds à but spécifique) où le donateur a une influence significative sur l'allocation des fonds. Cela comprend les contributions à des fonds d'affectation spéciale à donateur unique et les contributions affectées à des pays/emplacements géographiques spécifiques ou à des guichets de financement au sein de fonds d'affectation spéciale à donateur multiple. Lorsque le donateur conçoit l'activité mais la fait transiter par une organisation internationale, l'activité doit être classée en C01."]
["B04","Basket funds/pooled funding","Fonds communs/financements groupés","The donor contributes funds to an autonomous account, managed jointly with other donors and/or the recipient. The account will have specific purposes, modes of disbursement and accountability mechanisms, and a limited time frame. Basket funds are characterised by common project documents, common funding contracts and common reporting/audit procedures with all donors. Donors’ contributions to funds managed autonomously by international organisations are recorded under B03.","Le donneur dépose des fonds sur un compte autonome, géré conjointement avec d’autres donneurs et/ou le bénéficiaire. Sont associés à ce compte des objectifs, des modalités de versement, des mécanismes de reddition de comptes spécifiques, et un horizon temporel précis.La mise en commun de fonds suppose des documents de projet communs, des contrats de financement communs et des procédures de notification/audit communes à tous les donneurs.Les contributions des donneurs à des fonds gérés par des organisations internationales sont notifiées sous B03."]
["C01","Project-type interventions","Interventions de type projet","A project is a set of inputs, activities and outputs, agreed with the partner country*, to reach specific objectives/outcomes within a defined time frame, with a defined budget and a defined geographical area. Projects can vary significantly in terms of objectives, complexity, amounts involved and duration. There are smaller projects that might involve modest financial resources and last only a few months, whereas large projects might involve more significant amounts, entail successive phases and last for many years. A large project with a number of different components is sometimes referred to as a programme, but should nevertheless be recorded here.  Feasibility studies, appraisals and evaluations are included (whether designed as part of projects/programmes or dedicated funding arrangements).Aid channelled through NGOs or multilaterals is also recorded here. This includes payments for NGOs and multilaterals to implement donors’ projects and programmes, and funding of specified NGOs projects. By contrast, core funding of NGOs and multilaterals as well as contributions to specific-purpose funds managed by international organisations are recorded under B. * In the cases of equity investments, humanitarian aid or aid channelled through NGOs, projects are recorded here even if there was no direct agreement between the donor and the partner country.  ","Un projet est un ensemble d’éléments, d’activités et de produits, convenus avec le pays partenaire*, en vue d’atteindre des objectifs/résultats spécifiques dans un laps de temps et une zone géographique prédéfinis au moyen d’un budget fixé à l’avance. Les projets peuvent différer considérablement par leurs objectifs, leur complexité, les montants en jeu et leur durée. Si les petits projets ne mettent en jeu que des ressources financières modestes et ne durent souvent que quelques mois, les grands projets peuvent porter sur des montants substantiels, devoir être mis en œuvre par tranches et durer plusieurs années. Lorsqu’un grand projet se subdivise en plusieurs composantes, il est parfois appelé programme, mais doit néanmoins être comptabilisé dans la présente rubrique.  Sont inclues les études de faisabilité, ainsi que les évaluations préalables ou  rétrospectives (qu’elles soient conçues comme un volet du projet/programme ou qu’elles fassent l’objet de modalités de financement dédiées).L’aide acheminée par l’intermédiaire d’ONG ou d’organisations multilatérales est également notifiée ici. Cela comprend les paiements effectués aux ONG et aux organisations multilatérales pour qu’elles mettent en œuvre les projets et programmes des donneurs, ainsi que le financement de projets spécifiques des ONG. En revanche, les contributions de caractère général aux ONG et aux organisations multilatérales ainsi que les contributions aux fonds à objectif spécifique gérés par des organisations internationales sont notifiées sous B. * Dans le cas d’investissements sous forme de prises de participation, d’une aide humanitaire ou d’une aide par l’intermédiaire d’ONG, les projets sont notifiés ici même s’ils ne font pas l’objet d’un accord direct avec le pays partenaire."]
["D01","Donor country personnel","Personnel du pays donneur","Experts, consultants, teachers, academics, researchers, volunteers and contributions to public and private bodies for sending experts to developing countries.","Experts, consultants, enseignants, universitaires, chercheurs, stagiaires et volontaires, ainsi que contributions à des organismes publics et privés pour l’envoi d’experts dans les pays en développement. "]
["D02","Other technical assistance","Autres formes d’assistance technique ","Provision, outside projects as described in category C01, of technical assistance in recipient countries (excluding technical assistance performed by donor experts reported under D01, and scholarships/training in donor country reported under E01). This includes training and research; language training; south-south studies; research studies; collaborative research between donor and recipient universities and organisations); local scholarships; development-oriented social and cultural programmes. This category also covers ad hoc contributions such as conferences, seminars and workshops, exchange visits, publications, etc.","Cette catégorie couvre l’apport de savoir-faire en dehors de projets tels qu’ils sont définis dans la catégorie C01 (sauf l’assistance technique fournie par des experts des pays donneurs couverte sous D01, et les bourses/formations dans le pays donneur couvertes sous E01.) Sont inclues les activités de formation et de recherche, les formations linguistiques, les études Sud-Sud, les études pour la recherche, les activités de recherche impliquant une collaboration entre des universités ou organismes du pays donneur et du pays bénéficiaire, les bourses locales, et les programmes sociaux et culturels à des fins de développement. La catégorie couvre également les contributions ponctuelles telles les conférences, séminaires et ateliers, échanges, publications, etc."]
["E01","Scholarships/training in donor country","Bourses/formations dans le pays donneur","Financial aid awards for individual students and contributions to trainees.","Bourses octroyées à des étudiants et contributions aux frais associés à des stages."]
["E02","Imputed student costs","Coûts imputés des étudiants","Indirect (“imputed”) costs of tuition in donor countries.","Coûts indirects (“imputés”) correspondant aux frais de scolarité dans le pays donneur."]
["F01","Debt relief","Allégement de la dette","Groups all actions relating to debt (forgiveness, conversions, swaps, buy-backs, rescheduling, refinancing).","Regroupe toutes les actions se rapportant à la dette (annulation, conversion, échange, rachat, rééchelonnement, refinancement)."]
["G01","Administrative costs not included elsewhere","Frais administratifs non inclus ailleurs","Administrative costs of development assistance programmes not already included under other ODA items as an integral part of the costs of delivering or implementing the aid provided. This category covers situation analyses and auditing activities.As regards the salaries component of administrative costs, it relates to  in-house agency staff and contractors only; costs associated with donor experts/consultants are to be reported under category C or D01.","Frais d'administration des programmes d'aide au développement qui ne sont pas déjà inclus dans d'autres rubriques comme partie intégrante du coût de l’acheminement ou de la mise en œuvre de l’aide fournie. Cette catégorie comprend les analyses de situation et les activités d’audit.En ce qui concerne la composante salariale des frais administratifs, elle se rapporte uniquement au personnel et contractuels de l’agence ; les coûts associés aux experts/consultants du pays donneur sont à notifier sous les catégories C ou D01."]
["H01","Development awareness","Sensibilisation au développement ","Funding of activities designed to increase public support, i.e. awareness in the donor country of development co-operation efforts, needs and issues.","Financement d’activités visant à accroître le soutien du public dans le pays donneur pour les efforts de coopération pour le développement et à rendre la population plus consciente des besoins et problèmes du développement."]
["H02","Refugees/asylum seekers in donor countries","Refugiés/demandeurs d’asile dans les pays donneurs","Costs incurred in donor countries for basic assistance to asylum seekers and refugees from developing countries, up to 12 months, when costs cannot be disaggregated. See section II.6 and Annex 17.  ","Coûts encourus dans les pays donneurs au titre de l’aide de base apportée aux demandeurs d’asile et aux réfugiés en provenance des pays en développement pendant une période pouvant aller jusqu’à 12 mois, quand les coûts ne peuvent pas être désagrégés. Voir section II.6 et Annexe 17."]
["H03","Asylum-seekers ultimately accepted","Demandeurs d’asile finalement acceptés","Costs incurred in donor countries for basic assistance to asylum seekers, when these are ultimately accepted. This category includes only costs incurred prior to recognition.","Coûts encourus dans les pays donneurs au titre de l’aide de base apportée aux demandeurs d’asile lorsque ceux-ci sont finalement acceptés. Cette catégorie couvre uniquement les coûts encourus avant la reconnaissance de statut."]
["H04","Asylum-seekers ultimately rejected","Demandeurs d’asile finalement déboutés","Costs incurred in donor countries for basic assistance to asylum seekers, when these are ultimately rejected. This category includes only costs incurred prior to rejection. Members may base their reporting on the first instance rejection, where a final decision on status is anticipated to occur after a 12-month period, and this facilitates the establishment of a conservative estimate. For further guidance on how to proceed with calculating costs related to rejected asylum seekers, see Clarification 5, third bullet in section II.6 of the Reporting Directives.","Coûts encourus dans les pays donneurs au titre de l’aide de base apportée aux demandeurs d’asile lorsque ceux-ci sont finalement déboutés. Cette catégorie couvre uniquement les coûts encourus avant le rejet de la demande. Dans les cas où il est probable que la décision définitive relative au statut ne surviendra qu’après douze mois et afin de parvenir à une estimation prudente, les membres peuvent établir leur notification en fonction de la date du rejet en première instance. Pour plus d’instructions sur la façon de calculer les coûts relatifs aux demandeurs d’asile finalement déboutés, voir la Clarification 5, troisième point dans la section II.6 des Directives."]
["H05","Recognised refugees","Personnes auxquelles le statut de réfugié a été accordé","Costs incurred in donor countries for basic assistance to refugees with a recognised status. This category only includes costs after recognition (or after date of entry into a country through a resettlement programme).","Coûts encourus dans les pays donneurs au titre de l’aide de base apportée aux personnes auxquelles le statut de réfugié a été accordé. Cette catégorie couvre uniquement les coûts postérieurs à la reconnaissance (ou à la date d’entrée dans un pays dans le cadre d’un programme de réinstallation)."]
["H06","Refugees and asylum seekers in other provider countries"]
["J01","In-kind donation of goods"]
[]
["TOSSD specific codes"]
["Aid_T","Aid_T_Description_E","AidTDetailsE"]
["A00","Budget support","Identifies contributions from the provider to the government budget of a recipient country, which has exclusive responsibility for the use of and accountability for the funds. Budget support can be generic (not sector allocated) or sectoral (e.g. energy, agriculture)."]
["B01","Core support to NGOs, other private bodies, PPPs and research institutes","Contributions aux budgets réguliers des ONG, autres organismes privés, partenariats public-privé (PPP) et instituts de recherche","Funds are paid over to NGOs (local, national and international) for use at the latter’s discretion, and contribute to programmes and activities which NGOs have developed themselves, and which they implement on their own authority and responsibility. Core contributions to PPPs, funds paid over to foundations (e.g. philanthropic foundations), and contributions to research institutes (public and private) are also recorded here. Annex 2 of the DAC Directives provides a list of INGOs, PPPs and networks core contributions to which may be reported under B01. This list is not exclusive. ","Fonds versés à des PPP, réseaux, instituts de recherche et organismes privés à but non lucratif – ONG basées dans des pays en développement, dans des pays donneurs ou ONG internationales et autres organisations de la société civile par exemple les fondations philanthropiques – qui sont utilisés à la discrétion de ces organisations, et qui contribuent au financement de programmes et activités que ces organisations ont mis au point elles-mêmes et qu’elles mettent en œuvre sous leur propre autorité et responsabilité.La Liste des organisations internationales éligible en APD (voir l’annexe 2) fournit une liste d’ONGI, de PPP et de réseaux en faveur desquels les contributions aux budgets réguliers peuvent être notifiées sous B01. Cette liste n’est pas exhaustive."]
["B02","Core contributions to multilateral institutions","Contributions aux budgets réguliers des institutions multilatérales","These funds are classified as multilateral ODA (all other categories fall under bilateral ODA). The recipient multilateral institution pools contributions so that they lose their identity and become an integral part of its financial assets. See Annex 2 of the DAC Directives for a comprehensive list of agencies core contributions to which may be reported under B02 (Section I. Multilateral institutions).","Ces fonds sont comptabilisés en tant qu’APD multilatérale (toutes les autres catégories font partie de l’aide bilatérale). L’organisation internationale bénéficiaire fusionne les contributions, qui deviennent anonymes et font alors partie intégrante de ses avoirs financiers.La Liste des organisations internationales éligible en APD (voir l’annexe 2) fournit une liste complète des organisations en faveur desquelles les contributions aux budgets réguliers peuvent être notifiées sous B02."]
["B02a","Assessed contributions to multilateral institutions"]
["B02b","Voluntary core contributions to multilateral institutions"]
["B03","Contributions to specific-purpose programmes and funds managed by international organisations (multilateral, INGO)","Contributions à des programmes ou fonds à objectif spécifique gérés par des organisations internationales (multilatérales, ONGI)","In addition to their core-funded operations, international organisations set up and raise funds for specific programmes and funds with clearly identified sectoral, thematic or geographical focus. Donors’ bilateral contributions to such programmes and funds are recorded here, e.g. “UNICEF girls’ education”, “Education For All Fast Track Initiative”, various trust funds, including for reconstruction (e.g. Afghanistan Reconstruction Trust Fund).","Outre leurs opérations de base, les organisations internationales mettent en place et lèvent des financements pour des programmes ou fonds qui visent des objectifs sectoriels, thématiques ou géographiques spécifiques. Les contributions des donneurs à ce type de programmes et fonds entrent dans cette catégorie, par exemple celles destinées au « Réseau pour l’éducation des femmes et des filles » parrainé par l’UNICEF, à l’« Initiative pour la mise en œuvre accélérée du programme d’éducation pour tous », ou à divers fonds d’affectation spéciale, y compris pour la reconstruction (par exemple le Fonds d’affectation spéciale pour la reconstruction de l’Afghanistan - ARTF)."]
["B04","Basket funds/pooled funding","Fonds communs/financements groupés","The donor contributes funds to an autonomous account, managed jointly with other donors and/or the recipient. The account will have specific purposes, modes of disbursement and accountability mechanisms, and a limited time frame. Basket funds are characterised by common project documents, common funding contracts and common reporting/audit procedures with all donors. Donors’ contributions to funds managed autonomously by international organisations are recorded under B03.","Le donneur dépose des fonds sur un compte autonome, géré conjointement avec d’autres donneurs et/ou le bénéficiaire. Sont associés à ce compte des objectifs, des modalités de versement, des mécanismes de reddition de comptes spécifiques, et un horizon temporel précis.La mise en commun de fonds suppose des documents de projet communs, des contrats de financement communs et des procédures de notification/audit communes à tous les donneurs.Les contributions des donneurs à des fonds gérés par des organisations internationales sont notifiées sous B03."]
["C01","Projects","Identifies specific inputs, activities and outputs supported by a TOSSD provider, to reach specific objectives/outcomes within a defined time frame, with a defined budget and a defined geographical area."]
["D01","In-kind technical co-operation experts","Identifies technical co-operation implemented using public officials of the reporting country. Technical co-operation already embedded in the projects described above is not included, nor are experts hired on the market."]
["D02","Other technical co-operation","Includes the provision of technical  co-operation using internationally or locally recruited experts, beyond technical co-operation already embedded in the projects described above and beyond in-kind technical co-operation. All non-salary costs of experts (including those of public officials of the reporting country) such as flights, per-diem, accommodation, internal transportation within the recipient country and training, are also included. This category also covers training and research as well as various capacity building activities such as conferences, seminars, workshops, exchange visits."]
["E01","Scholarships/training in donor country","Reportable under Pillar I."]
["E02","Imputed student costs","Reportable under Pillar II."]
["F01","Debt relief - principal (original loan previously recorded in TOSSD)","Principal component of a debt relief operation, in cases where the loans concerned were previously recorded in TOSSD. The amount of principal will be automatically offset from the TOSSD gross and net measures, to avoid double counting."]
["F02","Debt relief - principal (original loan not recorded in TOSSD)","Principal component of a debt relief operation, in cases where the loans concerned were not previously recorded in TOSSD (private claims or official claims not previously recorded in TOSSD). "]
["F03","Debt relief - interest","Interest component of a debt relief operation (interests in arrears and late interests). "]
["G01","Administrative costs not included elsewhere","Includes administrative costs of delivering TOSSD activities (not included elsewhere). When the exact amount cannot be identified, reporters may estimate these costs as follows: i) take as a starting point the total administrative costs of development co-operation agencies and other official entities involved in the delivery of TOSSD activities; and ii) do a pro-rata calculation, reflecting the share of TOSSD-eligible activities and countries in total expenditures of the institution. Administrative costs are included in Pillar II, but the costs of country or regional offices may be reported against the code of the country or region in which the activities are conducted."]
["H00","Expenditures in the provider country","Expenditures in the provider country not included elsewhere."]
["I01","Support to refugees/protected persons in the provider country (up to 12 months of their stay) ","Costs incurred in provider countries for basic assistance to asylum seekers, refugees and protected persons from TOSSD-eligible countries, up to 12 months. Reportable under Pillar II."]
["I02","Support to refugees/protected persons in the provider country (beyond the 12-month period)","Costs incurred in provider countries for basic assistance to asylum seekers, refugees and protected persons from TOSSD-eligible countries, beyond the 12-month period, to the extent that the individual is not recognised by the competent authorities of the country in which he/she has sought asylum as having the rights and obligations which are attached to the possession of residency or nationality of that country. Reportable under Pillar II."]
["I05","Support to refugees/protected persons/migrants for their integration in the economy of provider countries","Costs incurred in provider countries for promoting the integration in their economy of asylum seekers, refugees, protected persons and migrants from TOSSD-eligible countries. Covers activities that promote the integration in the economy and culture of the provider country (including language training, vocational training, social protection schemes, employment programmes, awareness on national culture), up to the first 5 years of stay. Temporary sustenance/basic assistance is covered under modalities I01 and I02. Reportable under Pillar II."]
["K02","RESEARCH AND DEVELOPMENT (R&D)","Research and experimental development comprising creative and systematic work undertaken in order to increase the stock of knowledge – including knowledge of humankind, culture and society – and to devise new applications of available knowledge."]
[]
[]
["not indic"]
["F01"]
["F02"]
["F03"]
["G01"]
["I01"]
["I02"]
["I05"]

{"sheet":"donor_agency","index":9,"n_rows":1213,"n_cols":12,"rows_kept":1213,"cut":false,"hidden":true,"merged":[]}
["providercode","DonorNameE","DonorNameF","agencycode","agencyname","agencynamef","acronyme","acronymf","agencytype","notes","CRS","TOSSD"]
[1012,"Adaptation Fund","Fonds d'adaptation",1,"Adaptation Fund","Fonds d'adaptation","NULL","NULL",99,"Added by MM 2015-03",1,1]
[913,"African Development Bank","Banque Africaine de développement",1,"AfDB Ordinary Capital","BAfD","AfDB Ordinary Capital","AfDB Ordinary Capital",99,"NULL",1,1]
[913,"African Development Bank","Banque Africaine de développement",11,"AfDB Middle Income Country Fund","AfDB Middle Income Country Fund","NULL","NULL",99,"NULL",1,1]
[913,"African Development Bank","Banque Africaine de développement",12,"AfDB Special Relief Fund","AfDB Special Relief Fund","NULL","NULL",10,null,1,1]
[913,"African Development Bank","Banque Africaine de développement",14,"AfDB NEPAD/IPPF","AfDB NEPAD/IPPF","NULL","NULL",99,"NULL",1,1]
[913,"African Development Bank","Banque Africaine de développement",15,"AfDB African Water Facility Fund","AfDB African Water Facility Fund","NULL","NULL",10,null,1,1]
[913,"African Development Bank","Banque Africaine de développement",16,"Fund for African Private Sector Assistance","Fund for African Private Sector Assistance","NULL","NULL",10,null,1,1]
[913,"African Development Bank","Banque Africaine de développement",20,"Rural Water Supply & Sanitation","Rural Water Supply & Sanitation","NULL","NULL",7,"NULL",0,1]
[913,"African Development Bank","Banque Africaine de développement",21,"Zimbabwe Multi Donor Trust Fund","Zimbabwe Multi Donor Trust Fund","NULL","NULL",7,"NULL",0,1]
[913,"African Development Bank","Banque Africaine de développement",22,"Africa Digital Financial Inclusion Facility","Africa Digital Financial Inclusion Facility","ADFI","ADFI",7,"NULL",0,1]
[913,"African Development Bank","Banque Africaine de développement",23,"The Sustainable Energy Fund for Africa","The Sustainable Energy Fund for Africa","SEFA","SEFA",7,"NULL",0,1]
[913,"African Development Bank","Banque Africaine de développement",24,"Canada AfDB Climate Fund","Canada AfDB Climate Fund","NULL","NULL",7,"NULL",0,1]
[913,"African Development Bank","Banque Africaine de développement",25,"Clean Technology Fund","Clean Technology Fund","CTF","CTF",7,"NULL",0,1]
[913,"African Development Bank","Banque Africaine de développement",26,"Strategic Climat Fund","Strategic Climat Fund","SCF","SCF",7,"NULL",0,1]
[913,"African Development Bank","Banque Africaine de développement",27,"Global Environment Facility","Global Environment Facility","GEF","GEF",51,"GEF",0,1]
[914,"African Development Fund","Fonds Africaine de développement",1,"AfDF","FAfD","AfDF","AfDF",99,"NULL",1,1]
[914,"African Development Fund","Fonds Africaine de développement",2,"NTF","NTF","NTF","NTF",99,"NULL",1,1]
[914,"African Development Fund","Fonds Africaine de développement",13,"AfDB Fragile States Facility","AfDB Fragile States Facility","NULL","NULL",10,"NULL",1,1]
[953,"Arab Bank for Economic Development in Africa","Banque arabe pour le développement économique en Afrique",1,"Arab Bank for Economic Development in Africa","BADEA","BADEA","BADEA",99,"Added by F Daniel 02 11 2012",1,1]
[921,"Arab Fund (AFESD)","Fonds arabe (FADES)",1,"Arab Fund ","Fonds Arabe ","AFESD","FADES",99,"NULL",1,1]
[915,"Asian Development Bank","Banque Asiatique de développement",1,"Asian Development Bank","Banque asiatique du développement","AsDB","AsDB",99,"NULL",1,1]
[915,"Asian Development Bank","Banque Asiatique de développement",2,"Asia Pacific Disaster Response Fund","Asia Pacific Disaster Response Fund","APDRF","APDRF",10,"NULL",1,1]
[915,"Asian Development Bank","Banque Asiatique de développement",3,"Climate Change Fund","Climate Change Fund","CCF","CCF",10,"NULL",1,1]
[915,"Asian Development Bank","Banque Asiatique de développement",4,"Pakistan Earthquake Fund","Pakistan Earthquake Fund","PEF","PEF",99,"NULL",1,1]
[915,"Asian Development Bank","Banque Asiatique de développement",5,"Japan Special Fund","Japan Special Fund","JSF","JSF",10,"NULL",1,1]
[915,"Asian Development Bank","Banque Asiatique de développement",6,"Japan Fund for Prosperous and Resilient Asia and the Pacific","Japan Fund for Prosperous and Resilient Asia and the Pacific","NULL","NULL",7,"non-core",0,1]
[915,"Asian Development Bank","Banque Asiatique de développement",11,"Technical Assistance Special Fund (TASF)","Technical Assistance Special Fund (TASF)","TASF","TASF",10,"NULL",1,1]
[915,"Asian Development Bank","Banque Asiatique de développement",12,"Regional Cooperation and Integration Fund (RCIF)","Regional Cooperation and Integration Fund (RCIF)","RCIF","RCIF",10,"NULL",1,1]
[915,"Asian Development Bank","Banque Asiatique de développement",13,"Financial Sector Development Partnership Special Fund","Financial Sector Development Partnership Special Fund","FSDPSF","FSDPSF",10,"NULL",1,1]
[915,"Asian Development Bank","Banque Asiatique de développement",14,"Clean Technology Fund","Clean Technology Fund","CTF","CTF",7,"CIFs",0,1]
[915,"Asian Development Bank","Banque Asiatique de développement",15,"Strategic Climate Fund","Strategic Climate Fund","SCF","SCF",7,"CIFs",0,1]
[915,"Asian Development Bank","Banque Asiatique de développement",16,"Strategic Climate Fund - Forest Investment Program","Strategic Climate Fund - Forest Investment Program","SCF-FIP","SCF-FIP",7,"CIFs",0,1]
[915,"Asian Development Bank","Banque Asiatique de développement",17,"Strategic Climate Fund - Scaling Up Renewable Energy in LICs Program","Strategic Climate Fund - Scaling Up Renewable Energy in LICs Program","SCF-SURELICP","SCF-SURELICP",7,"CIFs",0,1]
[915,"Asian Development Bank","Banque Asiatique de développement",19,"ASEAN Infrastructure Fund","ASEAN Infrastructure Fund","AIF","AIF",7,"non-core",0,1]
[915,"Asian Development Bank","Banque Asiatique de développement",20,"Canadian Climate Fund For The Private Sector In Asia","Canadian Climate Fund For The Private Sector In Asia","CCF-PSA","CCF-PSA",7,"non-core",0,1]
[915,"Asian Development Bank","Banque Asiatique de développement",21,"Canadian Climate Fund For The Private Sector In Asia II","Canadian Climate Fund For The Private Sector In Asia II","CCF-PSAII","CCF-PSAII",7,"non-core",0,1]
[915,"Asian Development Bank","Banque Asiatique de développement",22,"Global Environment Facility","Global Environment Facility","GEF","GEF",51,"GEF",0,1]
[915,"Asian Development Bank","Banque Asiatique de développement",23,"Green Climate Fund","Green Climate Fund","GCF","GCF",7,"GCF",0,1]
[915,"Asian Development Bank","Banque Asiatique de développement",24,"Leading Asia's Private Sector Infrastructure Fund","Leading Asia's Private Sector Infrastructure Fund","LAPSIF","LAPSIF",7,"non-core",0,1]
[915,"Asian Development Bank","Banque Asiatique de développement",25,"Other non-core resources","Other non-core resources","NULL","NULL",7,"non-core",0,1]
[915,"Asian Development Bank","Banque Asiatique de développement",30,"Afghanistan Infrastructure Trust Fund","Afghanistan Infrastructure Trust Fund","NULL","NULL",7,"non-core",0,1]
[915,"Asian Development Bank","Banque Asiatique de développement",31,"ASEAN Australia Smart Cities Trust Fund","ASEAN Australia Smart Cities Trust Fund","NULL","NULL",7,"non-core",0,1]
[915,"Asian Development Bank","Banque Asiatique de développement",32,"Asia Pacific Project Preparation Facility","Asia Pacific Project Preparation Facility","NULL","NULL",7,"non-core",0,1]
[915,"Asian Development Bank","Banque Asiatique de développement",33,"Asia-Pacific Climate Finance Fund","Asia-Pacific Climate Finance Fund","NULL","NULL",7,"non-core",0,1]
[915,"Asian Development Bank","Banque Asiatique de développement",34,"Asian Clean Energy Fund","Asian Clean Energy Fund","NULL","NULL",7,"non-core",0,1]
[915,"Asian Development Bank","Banque Asiatique de développement",35,"Australian Technical Assistance Grant","Australian Technical Assistance Grant","NULL","NULL",7,"non-core",0,1]
[915,"Asian Development Bank","Banque Asiatique de développement",36,"Carbon Capture and Storage Fund","Carbon Capture and Storage Fund","NULL","NULL",7,"non-core",0,1]
[915,"Asian Development Bank","Banque Asiatique de développement",37,"Cities Development Initiative for Asia","Cities Development Initiative for Asia","NULL","NULL",7,"non-core",0,1]
[915,"Asian Development Bank","Banque Asiatique de développement",38,"Clean Energy Fund","Clean Energy Fund","NULL","NULL",7,"non-core",0,1]
[915,"Asian Development Bank","Banque Asiatique de développement",39,"Cooperation Fund for Project Preparation in the Greater Mekong Subregion and in Other Specific Asian Countries","Cooperation Fund for Project Preparation in the Greater Mekong Subregion and in Other Specific Asian Countries","NULL","NULL",7,"non-core",0,1]
[915,"Asian Development Bank","Banque Asiatique de développement",40,"Cooperation Fund in Support of Managing for Development Results","Cooperation Fund in Support of Managing for Development Results","NULL","NULL",7,"non-core",0,1]
[915,"Asian Development Bank","Banque Asiatique de développement",41,"Gender and Development Cooperation Fund","Gender and Development Cooperation Fund","NULL","NULL",7,"non-core",0,1]
[915,"Asian Development Bank","Banque Asiatique de développement",42,"Governance Cooperation Fund","Governance Cooperation Fund","NULL","NULL",7,"non-core",0,1]
[915,"Asian Development Bank","Banque Asiatique de développement",43,"High-Level Technology Fund","High-Level Technology Fund","NULL","NULL",7,"non-core",0,1]
[915,"Asian Development Bank","Banque Asiatique de développement",44,"Integrated Disaster Risk Management Fund","Integrated Disaster Risk Management Fund","NULL","NULL",7,"non-core",0,1]
[915,"Asian Development Bank","Banque Asiatique de développement",45,"Investment Climate Facilitation Fund","Investment Climate Facilitation Fund","NULL","NULL",7,"non-core",0,1]
[915,"Asian Development Bank","Banque Asiatique de développement",46,"Ireland Trust Fund for Building Climate Change and Disaster Resilience in Small Island Developing States","Ireland Trust Fund for Building Climate Change and Disaster Resilience in Small Island Developing States","NULL","NULL",7,"non-core",0,1]
[915,"Asian Development Bank","Banque Asiatique de développement",47,"Japan Fund for Information and Communication Technology","Japan Fund for Information and Communication Technology","NULL","NULL",7,"non-core",0,1]
[915,"Asian Development Bank","Banque Asiatique de développement",48,"Japan Fund for the Joint Crediting Mechanism","Japan Fund for the Joint Crediting Mechanism","NULL","NULL",7,"non-core",0,1]
[915,"Asian Development Bank","Banque Asiatique de développement",49,"Water Innovation Trust Fund under the Water Financing Partnership Facility","Water Innovation Trust Fund under the Water Financing Partnership Facility","NULL","NULL",7,"non-core",0,1]
[915,"Asian Development Bank","Banque Asiatique de développement",50,"People's Republic of China (PRC) Poverty Reduction and Regional Cooperation Fund (formerly PRC Regional Cooperation and Poverty Reduction Fund) ","People's Republic of China (PRC) Poverty Reduction and Regional Cooperation Fund (formerly PRC Regional Cooperation and Poverty Reduction Fund) ","NULL","NULL",7,"non-core",0,1]
[915,"Asian Development Bank","Banque Asiatique de développement",51,"Project Readiness Improvement Trust Fund ","Project Readiness Improvement Trust Fund ","NULL","NULL",7,"non-core",0,1]
[915,"Asian Development Bank","Banque Asiatique de développement",52,"Republic of Korea e-Asia and Knowledge Partnership Fund","Republic of Korea e-Asia and Knowledge Partnership Fund","NULL","NULL",7,"non-core",0,1]
[915,"Asian Development Bank","Banque Asiatique de développement",53,"Sanitation Financing Partnership Trust Fund under the Water Financing Partnership Facility","Sanitation Financing Partnership Trust Fund under the Water Financing Partnership Facility","NULL","NULL",7,"non-core",0,1]
[915,"Asian Development Bank","Banque Asiatique de développement",54,"Urban Climate Change Resilience Trust Fund","Urban Climate Change Resilience Trust Fund","NULL","NULL",7,"non-core",0,1]
[915,"Asian Development Bank","Banque Asiatique de développement",55,"Urban Environmental Infrastructure Fund","Urban Environmental Infrastructure Fund","NULL","NULL",7,"non-core",0,1]
[915,"Asian Development Bank","Banque Asiatique de développement",56,"Pakistan Economic Corridors Programme","Pakistan Economic Corridors Programme","NULL","NULL",7,"non-core",0,1]
[915,"Asian Development Bank","Banque Asiatique de développement",57,"Global Agriculture and Food Security Program","Global Agriculture and Food Security Program","NULL","NULL",7,"non-core",0,1]
[915,"Asian Development Bank","Banque Asiatique de développement",58,"Global Partnership for Education Fund","Global Partnership for Education Fund","NULL","NULL",7,"non-core",0,1]
[915,"Asian Development Bank","Banque Asiatique de développement",59,"United Kingdom Fund for Asia Regional Trade and Connectivity","United Kingdom Fund for Asia Regional Trade and Connectivity","NULL","NULL",7,"non-core",0,1]
[915,"Asian Development Bank","Banque Asiatique de développement",60,"ADB Ventures Investment Fund 1","ADB Ventures Investment Fund 1","NULL","NULL",7,"non-core; added by VT on TH request 24/08/2022",0,1]
[915,"Asian Development Bank","Banque Asiatique de développement",61,"ADB Co-financed Assistance Fund","ADB Co-financed Assistance Fund","NULL","NULL",7,"non-core",0,1]
[915,"Asian Development Bank","Banque Asiatique de développement",62,"Climate Innovation and Development Fund","Climate Innovation and Development Fund","NULL","NULL",7,"non-core",0,1]
[915,"Asian Development Bank","Banque Asiatique de développement",63,"Women Entrepreneurs Finance Initiative","Women Entrepreneurs Finance Initiative","We-Fi","We-Fi",7,"non-core",0,1]
[915,"Asian Development Bank","Banque Asiatique de développement",64,"Pandemic Prevention Response Fund","Pandemic Prevention Response Fund","PPRF","PPRF",7,"non-core",0,1]
[915,"Asian Development Bank","Banque Asiatique de développement",65,"Norwegian Grant (Other Projects)","Norwegian Grant (Other Projects)","NULL","NULL",7,"non-core",0,1]
[915,"Asian Development Bank","Banque Asiatique de développement",66,"Smart Energy Innovation Fund","Smart Energy Innovation Fund","SEIF","SEIF",7,"non-core",0,1]
[915,"Asian Development Bank","Banque Asiatique de développement",67,"United Kingdom-ASEAN Catalytic Green Finance Facility Trust Fund","United Kingdom-ASEAN Catalytic Green Finance Facility Trust Fund","NULL","NULL",7,"non-core",0,1]
[915,"Asian Development Bank","Banque Asiatique de développement",68,"ASEAN Infrastructure Fund - ASEAN Catalytic Green Finance Facility","ASEAN Infrastructure Fund - ASEAN Catalytic Green Finance Facility","NULL","NULL",7,"non-core",0,1]
[915,"Asian Development Bank","Banque Asiatique de développement",69,"Australian Climate Finance Partnership","Australian Climate Finance Partnership","NULL","NULL",7,"non-core",0,1]
[915,"Asian Development Bank","Banque Asiatique de développement",70,"Canadian Climate and Nature Fund for the Private Sector in Asia","Canadian Climate and Nature Fund for the Private Sector in Asia","NULL","NULL",7,"non-core",0,1]
[915,"Asian Development Bank","Banque Asiatique de développement",71,"Community Resilience Partnership Program Trust Fund","Community Resilience Partnership Program Trust Fund","NULL","NULL",7,"non-core",0,1]
[915,"Asian Development Bank","Banque Asiatique de développement",72,"Domestic Resource Mobilization Trust Fund","Domestic Resource Mobilization Trust Fund","NULL","NULL",7,"non-core",0,1]
[915,"Asian Development Bank","Banque Asiatique de développement",73,"Energy Transition Mechanism Partnership Trust Fund","Energy Transition Mechanism Partnership Trust Fund","NULL","NULL",7,"non-core",0,1]
[915,"Asian Development Bank","Banque Asiatique de développement",74,"European Union-ASEAN Catalytic Green Finance Facility Trust Fund","European Union-ASEAN Catalytic Green Finance Facility Trust Fund","NULL","NULL",7,"non-core",0,1]
[915,"Asian Development Bank","Banque Asiatique de développement",75,"GEAPP Energy Access and Transition Trust Fund","GEAPP Energy Access and Transition Trust Fund","NULL","NULL",7,"non-core",0,1]
[915,"Asian Development Bank","Banque Asiatique de développement",76,"GEF Least Developed Countries Fund ","GEF Least Developed Countries Fund ","NULL","NULL",51,"GEF",0,1]
[915,"Asian Development Bank","Banque Asiatique de développement",77,"GEF Special Climate Change Fund ","GEF Special Climate Change Fund ","NULL","NULL",51,"GEF",0,1]
[915,"Asian Development Bank","Banque Asiatique de développement",78,"Green Climate Fund for the ASEAN Catalytic Green Finance Facility - Green Recovery Program","Green Climate Fund for the ASEAN Catalytic Green Finance Facility - Green Recovery Program","NULL","NULL",7,"GCF",0,1]
[915,"Asian Development Bank","Banque Asiatique de développement",79,"Green Climate Fund for the Community Resilience Partnership Program Investment Fund","Green Climate Fund for the Community Resilience Partnership Program Investment Fund","NULL","NULL",7,"GCF",0,1]
[915,"Asian Development Bank","Banque Asiatique de développement",80,"Leading Asia's Private Infrastructure Fund 2","Leading Asia's Private Infrastructure Fund 2","NULL","NULL",7,"non-core",0,1]
[915,"Asian Development Bank","Banque Asiatique de développement",81,"Nonsovereign Revolving Trust Fund","Nonsovereign Revolving Trust Fund","NULL","NULL",7,"non-core",0,1]
[915,"Asian Development Bank","Banque Asiatique de développement",82,"Ocean Resilience and Coastal Adaptation Trust Fund","Ocean Resilience and Coastal Adaptation Trust Fund","NULL","NULL",7,"non-core",0,1]
[915,"Asian Development Bank","Banque Asiatique de développement",83,"Project Preparation and Implementation Support Trust Fund","Project Preparation and Implementation Support Trust Fund","NULL","NULL",7,"non-core",0,1]
[915,"Asian Development Bank","Banque Asiatique de développement",84,"Spanish Cooperation Fund for Technical Assistance","Spanish Cooperation Fund for Technical Assistance","NULL","NULL",7,"non-core",0,1]
[915,"Asian Development Bank","Banque Asiatique de développement",85,"Water Resilience Trust Fund","Water Resilience Trust Fund","NULL","NULL",7,"non-core",0,1]
[915,"Asian Development Bank","Banque Asiatique de développement",86,"Urban Resilience Trust Fund","Urban Resilience Trust Fund","NULL","NULL",7,"non-core",0,1]
[1053,"Asian Forest Cooperation Organisation","Organisation asiatique de coopération forestière",1,"AFoCO core resources","AFoCO (financement au budget régulier)","AFoCO","AFoCO",99,", Added 26/05/2023, by Baldock_M (M.Berbegal email of 24/05/2023)",1,1]
[1053,"Asian Forest Cooperation Organisation","Organisation asiatique de coopération forestière",2,"AFoCO non-core resources","AFoCO non-core resources","NULL","NULL",7,"non-core",0,1]
[1024,"Asian Infrastructure Investment Bank","Banque asiatique d'investissement dans les infrastructures",1,"Asian Infrastructure Investment Bank","Banque asiatique d'investissement dans les infrastructures","AIIB","AIIB",99,", Added 13/02/2018, by Baldock_M (AZ email of 31/01/2018)",1,1]
[1024,"Asian Infrastructure Investment Bank","Banque asiatique d'investissement dans les infrastructures",2,"Internal Special Funds","Internal Special Funds","NULL","NULL",99,null,1,1]
[1024,"Asian Infrastructure Investment Bank","Banque asiatique d'investissement dans les infrastructures",3,"External Special Funds","External Special Funds","NULL","NULL",7,null,0,1]
[981,"Black Sea Trade & Development Bank","Banque de développement de la mer Noire",1,"BSTDB Ordinary capital","BSTDB Ordinary capital","BSTDB","BSTDB",99,", Added 18/11/2021, by Baldock_M (T.Hos email of 17/11/2021)",1,1]
[906,"Caribbean Development Bank","Banque de développement des Caraïbes",1,"Caribbean Development Bank","Banque de développement des Caraïbes","CarDB","BDC",99,", Added 28/7/2016, by Baldock_M (AZ email of 28/7/2016)",1,1]
[906,"Caribbean Development Bank","Banque de développement des Caraïbes",2,"EU Sustainable Energy for the Eastern Caribbean Fund","EU Sustainable Energy for the Eastern Caribbean Fund","NULL","NULL",7,"non-core",0,1]
[906,"Caribbean Development Bank","Banque de développement des Caraïbes",3,"UK Sustainable Energy for the Eastern Caribbean Fund","UK Sustainable Energy for the Eastern Caribbean Fund","NULL","NULL",7,"non-core",0,1]
[906,"Caribbean Development Bank","Banque de développement des Caraïbes",4,"United Kingdom Infrastructure Fund","United Kingdom Infrastructure Fund","NULL","NULL",7,"non-core",0,1]
[906,"Caribbean Development Bank","Banque de développement des Caraïbes",5,"Canadian Support to the Energy Sector in the Caribbean Fund","Canadian Support to the Energy Sector in the Caribbean Fund","NULL","NULL",7,"non-core",0,1]
[906,"Caribbean Development Bank","Banque de développement des Caraïbes",6,"EIB Climate Action Line of Credit","EIB Climate Action Line of Credit","NULL","NULL",7,"non-core",0,1]
[906,"Caribbean Development Bank","Banque de développement des Caraïbes",7,"CDB-administered Deutsche Gesellschaft fuer Internationale Zusammenarbeit","CDB-administered Deutsche Gesellschaft fuer Internationale Zusammenarbeit","NULL","NULL",7,"non-core",0,1]
[906,"Caribbean Development Bank","Banque de développement des Caraïbes",8,"Canada - CARICOM Climate Adaptation Fund","Canada - CARICOM Climate Adaptation Fund","NULL","NULL",7,"non-core",0,1]
[906,"Caribbean Development Bank","Banque de développement des Caraïbes",9,"EU Caribbean Infrastructure Fund","EU Caribbean Infrastructure Fund","NULL","NULL",7,"non-core",0,1]
[906,"Caribbean Development Bank","Banque de développement des Caraïbes",10,"Other non-core resources","Other non-core resources","NULL","NULL",7,"non-core",0,1]
[906,"Caribbean Development Bank","Banque de développement des Caraïbes",11,"11th European Development Fund Economic Partnership Agreement and CARICOM Single Market and Economy","11th European Development Fund Economic Partnership Agreement and CARICOM Single Market and Economy","NULL","NULL",7,"non-core",0,1]
[906,"Caribbean Development Bank","Banque de développement des Caraïbes",99,"semi-aggregates, non-core ","semi-aggregates, non-core ","NULL","NULL",7,"non-core",0,1]
[1025,"Center of Excellence in Finance","Centre d'excellence en finance",1,"Center of Excellence in Finance","Centre d'excellence en finance","CEF","CEF",99,", Added 20/02/2018, by Baldock_M (AZ email of 13/02/2018)",1,1]
[910,"Central American Bank for Economic Integration","Banque centraméricaine d'intégration économique",1,"Ordinary capital","Ordinary capital","ORC","ORC",99,", Added 15/11/2021, by Baldock_M (T.Hos email of 15/11/2021)",1,1]
[910,"Central American Bank for Economic Integration","Banque centraméricaine d'intégration économique",2,"CABEI - non-core funding ","CABEI - non-core funding ","NULL","NULL",99,"non-core",0,1]
[910,"Central American Bank for Economic Integration","Banque centraméricaine d'intégration économique",3,"Central American Bank for EconomicKorea-CABEI Partnership Single Donor Trust Fund","Central American Bank for EconomicKorea-CABEI Partnership Single Donor Trust Fund","NULL","NULL",7,"non-core",0,1]
[1020,"Central Emergency Response Fund","Fonds central d'intervention pour les urgences humanitaires",1,"Rapid Response","Réponse rapide","NULL","NULL",99,", Added 16/11/2018, by Baldock_M (email from A.Zimmerman 08/11/2018)",1,1]
[1020,"Central Emergency Response Fund","Fonds central d'intervention pour les urgences humanitaires",2,"Under Funded","Sous financé","NULL","NULL",99,", Added 16/11/2018, by Baldock_M (email from A.Zimmerman 08/11/2018)",1,1]
[1055,"CGIAR","CGIAR",1,"CGIAR","CGIAR","NULL","NULL",99,", Added 20/11/2023, by Baldock_M (M.Berbegal email of 17/11/2023)",1,1]
[1011,"Climate Investment Funds","Fonds d'investissement climatique",10,"Clean Technology Fund","Clean Technology Fund","CTF","CTF",99,"Added by MM 2015-03",1,1]
[1011,"Climate Investment Funds","Fonds d'investissement climatique",20,"Strategic Climate Fund","Strategic Climate Fund","SCF","SCF",99,"Added by MM 2015-03",1,1]
[1011,"Climate Investment Funds","Fonds d'investissement climatique",21,"Strategic Climate Fund - FIP","Strategic Climate Fund - FIP","SCF - FIP","SCF - FIP",99,"Added by MM 2015-03",1,1]
[1011,"Climate Investment Funds","Fonds d'investissement climatique",22,"Strategic Climate Fund - PPCR","Strategic Climate Fund - PPCR","SCF - PPCR","SCF - PPCR",99,"Added by MM 2015-03",1,1]
[1011,"Climate Investment Funds","Fonds d'investissement climatique",23,"Strategic Climate Fund - SREP","Strategic Climate Fund - SREP","SCF - SREP","SCF - SREP",99,"Added by MM 2015-03",1,1]
[926,"Council of Europe","Conseil de l'Europe",1,"Council of Europe (CoE)","Conseil de l'Europe (CoE)","CoE","CoE",99,"Added by GS 2014-12",1,1]
[1013,"Council of Europe Development Bank","Banque de développement du Conseil de l'Europe",1,"Council of Europe Development Bank (CEB)","Banque de développement du Conseil de l'Europe (CEB)","NULL","NULL",99,"Added MB 2015-06-01",1,1]
[1013,"Council of Europe Development Bank","Banque de développement du Conseil de l'Europe",2,"Migrant and Refugee Fund","Fonds pour les Migrants et les Réfugiés","NULL","NULL",99,", Added 27/7/2016, by Baldock_M (AZ email of 27/7/2016)",1,1]
[1013,"Council of Europe Development Bank","Banque de développement du Conseil de l'Europe",3,"Social Impact Account","Compte d'impact social","NULL","NULL",99,", Added 18/11/2020, by Baldock_M (A.Golenko email of 17/11/20), update name from 'Social Dividend Account'(Sandie Xu email 13/08/2025) by VT",1,1]
[1013,"Council of Europe Development Bank","Banque de développement du Conseil de l'Europe",4,"Migrant and Refugee Fund","Migrant and Refugee Fund","NULL","NULL",7,"non-core",0,1]
[1013,"Council of Europe Development Bank","Banque de développement du Conseil de l'Europe",5,"Regional Housing Programme","Regional Housing Programme","NULL","NULL",7,"non-core",0,1]
[1013,"Council of Europe Development Bank","Banque de développement du Conseil de l'Europe",6,"Regional Housing Programme EU","Regional Housing Programme EU","NULL","NULL",7,"non-core",0,1]
[1013,"Council of Europe Development Bank","Banque de développement du Conseil de l'Europe",7,"Western Balkans Investment Framework","Western Balkans Investment Framework","NULL","NULL",7,"non-core",0,1]
[1013,"Council of Europe Development Bank","Banque de développement du Conseil de l'Europe",8,"Italian Fund for Innovative Projects","Italian Fund for Innovative Projects","NULL","NULL",7,"non-core",0,1]
[1013,"Council of Europe Development Bank","Banque de développement du Conseil de l'Europe",9,"Spanish Social Cohesion Account ","Spanish Social Cohesion Account ","NULL","NULL",7,"non-core",0,1]
[1013,"Council of Europe Development Bank","Banque de développement du Conseil de l'Europe",10,"EU Facility for Refugees in Turkey","EU Facility for Refugees in Turkey","NULL","NULL",7,"non-core",0,1]
[1013,"Council of Europe Development Bank","Banque de développement du Conseil de l'Europe",11,"Regional Housing Programme USA","Regional Housing Programme USA","NULL","NULL",7,"non-core",0,1]
[1013,"Council of Europe Development Bank","Banque de développement du Conseil de l'Europe",12,"Slovak Inclusive Growth Account","Slovak Inclusive Growth Account","NULL","NULL",7,"non-core",0,1]
[1013,"Council of Europe Development Bank","Banque de développement du Conseil de l'Europe",13,"Eastern Europe Energy Efficiency and Environmental Partnership","Eastern Europe Energy Efficiency and Environmental Partnership","NULL","NULL",7,"non-core",0,1]
[1013,"Council of Europe Development Bank","Banque de développement du Conseil de l'Europe",14,"Strengthening Healthcare Infrastructure for All (SHIFA)","Strengthening Healthcare Infrastructure for All (SHIFA)","NULL","NULL",7,"non-core",0,1]
[1013,"Council of Europe Development Bank","Banque de développement du Conseil de l'Europe",15,"Ukraine Solidarity Fund","Ukraine Solidarity Fund","NULL","NULL",7,"non-core",0,1]
[1047,"COVID-19 Response and Recovery Multi-Partner Trust Fund","COVID-19 Response and Recovery Multi-Partner Trust Fund",1,"COVID-19 Response and Recovery Multi-Partner Trust Fund","COVID-19 Response and Recovery Multi-Partner Trust Fund","UN COVID-1","UN COVID-1",99,", Added 20/10/2022, by Baldock_M (M.Berbegal email of 20/10/2022)",1,1]
[1047,"COVID-19 Response and Recovery Multi-Partner Trust Fund","COVID-19 Response and Recovery Multi-Partner Trust Fund",2,"TOSSD-only recipients","TOSSD-only recipients","NULL","NULL",8,"Added 21/09/2023 by Thielemans_V (Berbegal_m)",0,1]
[1017,"Credit Guarantee and Investment Facility","Credit Guarantee and Investment Facility",1,"Credit Guarantee and Investment Facility","Credit Guarantee and Investment Facility","CGIF","CGIF",99,", Added 04/12/2017, by Baldock_M (email from T.Hos 04/12/2017)",1,1]
[1015,"Development Bank of Latin America","Banque de développement de l'Amérique latine",1,"Development Bank of Latin America","CAF","CAF","CAF",99,"Added by MM 2015-09",1,1]
[918,"EU Institutions","Institutions de l'UE",1,"European Commission","Commission européenne","EC","EC",1,"NULL",1,1]
[918,"EU Institutions","Institutions de l'UE",2,"European Development Fund","Fonds européen de développement","EDF","EDF",1,"NULL",1,1]
[918,"EU Institutions","Institutions de l'UE",3,"European Investment Bank","Banque européenne d'investissement","EIB","EIB",2,"NULL",1,1]
[918,"EU Institutions","Institutions de l'UE",4,"Humanitarian Aid Office of the European Commission","Bureau d'aide humanitaire de la Commission européenne","ECHO","ECHO",2,"NULL",1,1]
[918,"EU Institutions","Institutions de l'UE",5,"Macro-Financial Assistance","Assistance macrofinancière","MFA","AMF",2,", Added 30/03/2022, by Baldock_M (O.Bouret email of 30/03/2022)",1,1]
[918,"EU Institutions","Institutions de l'UE",99,"Miscellaneous","Divers","MISC","MISC",2,"Unknown agency code",1,1]
[990,"European Bank for Reconstruction and Development","Banque européenne pour la reconstruction et le développement",1,"EBRD","BERD","EBRD","EBRD",99,"NULL",1,1]
[990,"European Bank for Reconstruction and Development","Banque européenne pour la reconstruction et le développement",2,"Global Environment Facility","Global Environment Facility","GEF","GEF",51,"GEF",0,1]
[932,"Food and Agriculture Organisation","Organisation pour l'alimentation et l'agriculture",1,"Core resources - developmental","Core resources - developmental","NULL","NULL",11,"NULL",1,1]
[932,"Food and Agriculture Organisation","Organisation pour l'alimentation et l'agriculture",2,"Voluntary earmarked contributions – developmental","Voluntary earmarked contributions – developmental","NULL","NULL",7,"NULL",0,1]
[932,"Food and Agriculture Organisation","Organisation pour l'alimentation et l'agriculture",3,"Core resources - global and TOSSD-only activities","Core resources - global and TOSSD-only activities","NULL","NULL",8,"NULL",0,1]
[932,"Food and Agriculture Organisation","Organisation pour l'alimentation et l'agriculture",4,"Voluntary earmarked contributions - global and TOSSD-only activities","Voluntary earmarked contributions - global and TOSSD-only activities","NULL","NULL",8,"NULL",0,1]
[932,"Food and Agriculture Organisation","Organisation pour l'alimentation et l'agriculture",5,"Global Environment Facility","Global Environment Facility","GEF","GEF",51,"GEF",0,1]
[1311,"Global Alliance for Vaccines and Immunization","Alliance mondiale pour les vaccins et la vaccination",1,"GAVI","GAVI","GAVI","GAVI",1,"NULL",1,1]
[1311,"Global Alliance for Vaccines and Immunization","Alliance mondiale pour les vaccins et la vaccination",2,"International Finance Facility for Immunisation ","International Finance Facility for Immunisation ","IFFIm","IFFIm",1,"NULL",1,1]
[1311,"Global Alliance for Vaccines and Immunization","Alliance mondiale pour les vaccins et la vaccination",3,"COVAX, non-core","COVAX, non-core","NULL","NULL",7,"non-core",0,1]
[1311,"Global Alliance for Vaccines and Immunization","Alliance mondiale pour les vaccins et la vaccination",4,"non-core (other than COVAX)","non-core (other than COVAX)","NULL","NULL",7,"non-core",0,1]
[1018,"Global Energy Efficiency and Renewable Energy Fund","Fonds mondial de l'efficacité énergétique et des énergies renouvelables",1,"Global Energy Efficiency and Renewable Energy Fund","Fonds mondial de l'efficacité énergétique et des énergies renouvelables","GEEREF","GEEREF",99,", Added 10/01/2017, by Baldock_M",1,1]
[811,"Global Environment Facility","Fonds pour l'environnement mondial",1,"GEF (general)","FEM (général)","GEF","GEF",99,"Modified by GS 2013-12",1,1]
[811,"Global Environment Facility","Fonds pour l'environnement mondial",11,"GEF Trust Fund","Fonds fiduciaire du FEM","NULL","NULL",99,"Added by GS 2014-11",1,1]
[811,"Global Environment Facility","Fonds pour l'environnement mondial",12,"Least Developed Countries Trust Fund (LDCF)","Fonds pour les pays les moins avancés (FPMA)","LDCF","FPMA",99,"Added by GS 2014-11",1,1]
[811,"Global Environment Facility","Fonds pour l'environnement mondial",13,"Special Climate Change Trust Fund (SCCF)","Fonds spécial pour le changement climatique (FSCC)","SCCF","FSCC",99,"Added by GS 2014-11",1,1]
[811,"Global Environment Facility","Fonds pour l'environnement mondial",14,"Nagoya Protocol Implementation Fund (NPIF)","Fonds de mise en œuvre du protocole de Nagoya (NPIF)","NPIF","NPIF",99,"Added by GS 2014-11",1,1]
[811,"Global Environment Facility","Fonds pour l'environnement mondial",15,"GEF Capacity Building Initiative for Transparency","FEM Initiative de renforcement des capacités pour la transparence","CBIT","IRCT",99,", Added by MB 2017-07-27, AZ email of 27/07/2017",1,1]
[811,"Global Environment Facility","Fonds pour l'environnement mondial",16,"GEF Multi-Trust Funds","Fonds multi-fiduciaires du FEM","MTF","FMF",99,", Added by MB 2017-07-27, AZ email of 27/07/2017",1,1]
[811,"Global Environment Facility","Fonds pour l'environnement mondial",17,"GEF - regional and global","GEF - regional and global","NULL","NULL",51,"previoulsy 8",0,1]
[811,"Global Environment Facility","Fonds pour l'environnement mondial",18,"GEF - earmarked","GEF - earmarked","NULL","NULL",51,"previously 7",0,1]
[811,"Global Environment Facility","Fonds pour l'environnement mondial",19,"Global Biodiversity Framework Fund (GBFF)","Global Biodiversity Framework Fund (GBFF)","GBFF","GBFF",99,"NULL",1,1]
[1312,"Global Fund","Fonds mondial",1,"Global Fund","Global Fund","Global Fund","Global Fund",99,"NULL",1,1]
[1313,"Global Green Growth Institute","Institut mondial de la croissance verte",1,"Green Growth Planning and Implementation","Green Growth Planning and Implementation","GGPI","GGPI",99,", Added by Baldock_M 20/08/18 (GS email of 20/08/2018)",1,1]
[1313,"Global Green Growth Institute","Institut mondial de la croissance verte",2,"Investment and Policy Solutions Division","Investment and Policy Solutions Division","IPSD","IPSD",99,", Added by Baldock_M 20/08/18 (GS email of 20/08/2018)",1,1]
[1313,"Global Green Growth Institute","Institut mondial de la croissance verte",3,"Thought Leadership","Thought Leadership","TL","TL",99,", Added by Baldock_M 20/08/18 (GS email of 20/08/2018)",1,1]
[1313,"Global Green Growth Institute","Institut mondial de la croissance verte",4,"Green Investment Services","Green Investment Services","GIS","GIS",99,", Added by Baldock_M 20/08/18 (GS email of 20/08/2018)",1,1]
[1313,"Global Green Growth Institute","Institut mondial de la croissance verte",5,"Green Growth Planning and Implementation","Green Growth Planning and Implementation","NULL","NULL",7,"non-core",0,1]
[1313,"Global Green Growth Institute","Institut mondial de la croissance verte",6,"Investment and Policy Solutions Division","Investment and Policy Solutions Division","NULL","NULL",7,"non-core",0,1]
[997,"Global Partnership for Education","Partenariat mondial pour l'Éducation",1,"FTI","FTI","FTI","FTI",99,"NULL",1,1]
[1016,"Green Climate Fund","Fonds vert pour le climat",1,"Green Climate Fund","Fonds vert pour le climat","GCF","FVC",99,", Added 15/11/2016 (AZ email of 14/11/2016)",1,1]
[1016,"Green Climate Fund","Fonds vert pour le climat",2,"Private Sector Facility","Private Sector Facility","GCF","FVC",99,", Added 15/11/2016 (AZ email of 14/11/2016)",1,1]
[1016,"Green Climate Fund","Fonds vert pour le climat",3,"Division of Mitigation and Adaptation","Division of Mitigation and Adaptation","GCF","FVC",99,", Added 15/11/2016 (AZ email of 14/11/2016)",1,1]
[1019,"IDB Invest","BID Invest",1,"IDB Invest","BID Invest","NULL","NULL",99,", Added 04/12/2017, by Baldock_M (A.Bejraoui email of 27/11/2017)",1,1]
[988,"IFAD","FIDA",1,"IFAD","IFAD","IFAD","IFAD",99,"NULL",1,1]
[988,"IFAD","FIDA",2,"China-IFAD South-South and Triangular Cooperation Facility","China-IFAD South-South and Triangular Cooperation Facility","NULL","NULL",7,"non-core",0,1]
[988,"IFAD","FIDA",3,"Enhanced Adaptation for Smallholder Agriculture Programme (ASAP+)","Enhanced Adaptation for Smallholder Agriculture Programme (ASAP+)","ASAP+","ASAP+",7,"non-core",0,1]
[958,"IMF (Concessional Trust Funds)","FMI (Fonds fiduciaires concessionnels)",1,"IMF concessional","FMI concessionnel","NULL","NULL",99,"NULL",1,1]
[1058,"IMF Resilience and Sustainability Trust","Fonds de résilience et de durabilité du FMI",1,"IMF Resilience and Sustainability Trust","Fonds de résilience et de durabilité du FMI","NULL","NULL",99,", Added 17/04/2024, by Baldock_M (S.Xu email of 17/04/2024)",1,1]
[909,"Inter-American Development Bank","Banque Interaméricaine de développement",1,"Inter-American Development Bank Group","Inter-American Development Bank Group","NULL","NULL",1,"NULL",1,1]
[909,"Inter-American Development Bank","Banque Interaméricaine de développement",2,"Fund for Special Operations","Fund for Special Operations","FSO","FSO",1,", Added 20/11/2018 by Baldock_M, G.Simon email of 19/11/18",1,1]
[909,"Inter-American Development Bank","Banque Interaméricaine de développement",3,"Fund for Special Operations-Ordinary Capital","Fund for Special Operations-Ordinary Capital","FSO-ORC","FSO-ORC",2,"Added by AZ 20120912-Modified by GS 20131023",1,1]
[909,"Inter-American Development Bank","Banque Interaméricaine de développement",4,"Ordinary Capital","Ordinary Capital","ORC","ORC",2,"Added by AZ 20120912",1,1]
[909,"Inter-American Development Bank","Banque Interaméricaine de développement",5,"Multilateral Investment Fund","Multilateral Investment Fund","MIF","MIF",2,"Added by AZ 20120912",1,1]
[909,"Inter-American Development Bank","Banque Interaméricaine de développement",6,"Grant Facility","Grant Facility","GRF","GRF",2,"Added by AZ 20120912",1,1]
[909,"Inter-American Development Bank","Banque Interaméricaine de développement",11,"Clean Technology Fund","Clean Technology Fund","CTF","CTF",99,"Added by AZ 20120912",1,1]
[909,"Inter-American Development Bank","Banque Interaméricaine de développement",13,"Global Agriculture & Food Security Program Trust Fund","Global Agriculture & Food Security Program Trust Fund","GAF","GAF",7,"non-core",0,1]
[909,"Inter-American Development Bank","Banque Interaméricaine de développement",14,"Strategic Climate Fund","Strategic Climate Fund","SCX","SCX",99,"Added by AZ 20120912",1,1]
[909,"Inter-American Development Bank","Banque Interaméricaine de développement",15,"Small Enterprise Development Facility","Small Enterprise Development Facility","MSE","MSE",2,", Added 20/12/2019 by Baldock_M, A.Golenko email of 20/12/19",1,1]
[909,"Inter-American Development Bank","Banque Interaméricaine de développement",16,"Small Enterprise Investment Fund","Small Enterprise Investment Fund","MSF","MSF",2,", Added 20/12/2019 by Baldock_M, A.Golenko email of 20/12/19",1,1]
[909,"Inter-American Development Bank","Banque Interaméricaine de développement",17,"Human Resource Facility","Human Resource Facility","MHR","MHR",2,", Added 20/12/2019 by Baldock_M, A.Golenko email of 20/12/19",1,1]
[909,"Inter-American Development Bank","Banque Interaméricaine de développement",18,"IDB Grant Facility","IDB Grant Facility","GRF","GRF",2,"Added 24/11/2020",1,1]
[909,"Inter-American Development Bank","Banque Interaméricaine de développement",20,"Fund for Increasing Productivity and Promoting Inclusive Economic Growth","Fund for Increasing Productivity and Promoting Inclusive Economic Growth","MPF","MPF",2,"Added 24/11/2020",1,1]
[909,"Inter-American Development Bank","Banque Interaméricaine de développement",21,"Transparency Trust Fund","Transparency Trust Fund","NULL","NULL",7,"non-core",0,1]
[909,"Inter-American Development Bank","Banque Interaméricaine de développement",22,"NDC Pipeline Accelerator Multidonor Trust Fund","NDC Pipeline Accelerator Multidonor Trust Fund","NULL","NULL",7,"non-core",0,1]
[909,"Inter-American Development Bank","Banque Interaméricaine de développement",23,"Ad Hoc Contributions","Ad Hoc Contributions","ADH","ADH",7,"non-core",0,1]
[909,"Inter-American Development Bank","Banque Interaméricaine de développement",24,"Aid for Trade Strategic Thematic Fund","Aid for Trade Strategic Thematic Fund","AFT","AFT",7,"non-core",0,1]
[909,"Inter-American Development Bank","Banque Interaméricaine de développement",25,"Partnership Trust Fund for Poverty Reduction in Latin America","Partnership Trust Fund for Poverty Reduction in Latin America","AUS","AUS",7,"non-core",0,1]
[909,"Inter-American Development Bank","Banque Interaméricaine de développement",26,"Brazilian Cofinancing Account","Brazilian Cofinancing Account","NULL","NULL",7,"non-core",0,1]
[909,"Inter-American Development Bank","Banque Interaméricaine de développement",27,"Canada Cooperation Framework","Canada Cooperation Framework","NULL","NULL",7,"non-core",0,1]
[909,"Inter-American Development Bank","Banque Interaméricaine de développement",28,"Compete Caribbean Partnership Facility ","Compete Caribbean Partnership Facility ","NULL","NULL",7,"non-core",0,1]
[909,"Inter-American Development Bank","Banque Interaméricaine de développement",29,"Canadian Fund for Universal Legal Identity in Latin America and the Caribbean","Canadian Fund for Universal Legal Identity in Latin America and the Caribbean","CCR","CCR",7,"non-core",0,1]
[909,"Inter-American Development Bank","Banque Interaméricaine de développement",30,"Canadian Fund","Canadian Fund","NULL","NULL",7,"non-core",0,1]
[909,"Inter-American Development Bank","Banque Interaméricaine de développement",31,"China Co-Financing Fund for Latin America and the Caribbean","China Co-Financing Fund for Latin America and the Caribbean","NULL","NULL",7,"non-core",0,1]
[909,"Inter-American Development Bank","Banque Interaméricaine de développement",32,"Canadian Joint Financing Programs","Canadian Joint Financing Programs","CJF","CJF",7,"non-core",0,1]
[909,"Inter-American Development Bank","Banque Interaméricaine de développement",33,"Cofinancing Special Grants","Cofinancing Special Grants","NULL","NULL",7,"non-core",0,1]
[909,"Inter-American Development Bank","Banque Interaméricaine de développement",34,"Sustainable Colombia Facility","Sustainable Colombia Facility","NULL","NULL",7,"non-core",0,1]
[909,"Inter-American Development Bank","Banque Interaméricaine de développement",35,"Canadian Climate Fund for the Private Sector in the Americas","Canadian Climate Fund for the Private Sector in the Americas","CPS","CPS",7,"non-core",0,1]
[909,"Inter-American Development Bank","Banque Interaméricaine de développement",36,"DEFRA Cofinancing Account","DEFRA Cofinancing Account","DEF","DEF",7,"non-core",0,1]
[909,"Inter-American Development Bank","Banque Interaméricaine de développement",37,"Early Childhood Development Innovation Multidonor Fund","Early Childhood Development Innovation Multidonor Fund","NULL","NULL",7,"non-core",0,1]
[909,"Inter-American Development Bank","Banque Interaméricaine de développement",38,"European Commission Amended and Restated Framework Agreement","European Commission Amended and Restated Framework Agreement","NULL","NULL",7,"non-core",0,1]
[909,"Inter-American Development Bank","Banque Interaméricaine de développement",39,"European Commission Framework Account","European Commission Framework Account","NULL","NULL",7,"non-core",0,1]
[909,"Inter-American Development Bank","Banque Interaméricaine de développement",40,"Sustainable Emerging Cities Multidonor Trust Fund","Sustainable Emerging Cities Multidonor Trust Fund","ESC","ESC",7,"non-core",0,1]
[909,"Inter-American Development Bank","Banque Interaméricaine de développement",41,"Readiness Fund of the Forest Carbon Partnership Facility","Readiness Fund of the Forest Carbon Partnership Facility","NULL","NULL",7,"non-core",0,1]
[909,"Inter-American Development Bank","Banque Interaméricaine de développement",42,"Spanish Trust Fund for the Entrepreneurship Program","Spanish Trust Fund for the Entrepreneurship Program","NULL","NULL",7,"non-core",0,1]
[909,"Inter-American Development Bank","Banque Interaméricaine de développement",43,"Spanish General Cooperation Fund","Spanish General Cooperation Fund","NULL","NULL",7,"non-core",0,1]
[909,"Inter-American Development Bank","Banque Interaméricaine de développement",44,"Global Infrastructure Facility","Global Infrastructure Facility","NULL","NULL",7,"non-core",0,1]
[909,"Inter-American Development Bank","Banque Interaméricaine de développement",45,"Finnish Technical Assistance Program","Finnish Technical Assistance Program","FTA","FTA",7,"non-core",0,1]
[909,"Inter-American Development Bank","Banque Interaméricaine de développement",46,"Guyana REDD+ Investment Fund","Guyana REDD+ Investment Fund","GIF","GIF",7,"non-core",0,1]
[909,"Inter-American Development Bank","Banque Interaméricaine de développement",47,"Haiti Reconstruction Fund","Haiti Reconstruction Fund","NULL","NULL",7,"non-core",0,1]
[909,"Inter-American Development Bank","Banque Interaméricaine de développement",48,"Italian Trust Fund for Regional Competitiveness","Italian Trust Fund for Regional Competitiveness","NULL","NULL",7,"non-core",0,1]
[909,"Inter-American Development Bank","Banque Interaméricaine de développement",49,"Institutional Capacity Strengthening Thematic Fund","Institutional Capacity Strengthening Thematic Fund","NULL","NULL",7,"non-core",0,1]
[909,"Inter-American Development Bank","Banque Interaméricaine de développement",50,"INTAL","INTAL","INT","INT",7,"non-core",0,1]
[909,"Inter-American Development Bank","Banque Interaméricaine de développement",51,"Italian Fund for Technical Cooperation Projects","Italian Fund for Technical Cooperation Projects","NULL","NULL",7,"non-core",0,1]
[909,"Inter-American Development Bank","Banque Interaméricaine de développement",52,"Italian Trust Fund for the Preparation of MIF Projects","Italian Trust Fund for the Preparation of MIF Projects","ITM","ITM",7,"non-core",0,1]
[909,"Inter-American Development Bank","Banque Interaméricaine de développement",53,"Japanese Consultants Fund","Japanese Consultants Fund","JCF","JCF",7,"non-core",0,1]
[909,"Inter-American Development Bank","Banque Interaméricaine de développement",54,"Japan Special Fund Poverty Reduction Program","Japan Special Fund Poverty Reduction Program","NULL","NULL",7,"non-core",0,1]
[909,"Inter-American Development Bank","Banque Interaméricaine de développement",55,"Japan Private Public Partnership Financing Account","Japan Private Public Partnership Financing Account","NULL","NULL",7,"non-core",0,1]
[909,"Inter-American Development Bank","Banque Interaméricaine de développement",56,"Japan Special Fund","Japan Special Fund","NULL","NULL",7,"non-core",0,1]
[909,"Inter-American Development Bank","Banque Interaméricaine de développement",57,"Knowledge Multidonor Economy Fund","Knowledge Multidonor Economy Fund","KEF","KEF",7,"non-core",0,1]
[909,"Inter-American Development Bank","Banque Interaméricaine de développement",58,"Korea Infrastructure Development Co-Financing Facility for Latin America and the Caribbean","Korea Infrastructure Development Co-Financing Facility for Latin America and the Caribbean","NULL","NULL",7,"non-core",0,1]
[909,"Inter-American Development Bank","Banque Interaméricaine de développement",59,"Public Capacity Building Korea Fund for Economic Development","Public Capacity Building Korea Fund for Economic Development","NULL","NULL",7,"non-core",0,1]
[909,"Inter-American Development Bank","Banque Interaméricaine de développement",60,"Knowledge Partnership Korea Fund for Technology and Innovation","Knowledge Partnership Korea Fund for Technology and Innovation","NULL","NULL",7,"non-core",0,1]
[909,"Inter-American Development Bank","Banque Interaméricaine de développement",61,"Korea Poverty Reduction Fund","Korea Poverty Reduction Fund","NULL","NULL",7,"non-core",0,1]
[909,"Inter-American Development Bank","Banque Interaméricaine de développement",62,"Korea Private Sector Development and Innovation Fund","Korea Private Sector Development and Innovation Fund","NULL","NULL",7,"non-core",0,1]
[909,"Inter-American Development Bank","Banque Interaméricaine de développement",63,"LAIF grant to CC and W&S","LAIF grant to CC and W&S","NULL","NULL",7,"non-core",0,1]
[909,"Inter-American Development Bank","Banque Interaméricaine de développement",64,"Low Carbon Agriculture for Avoided Deforestation and Poverty Reduction","Low Carbon Agriculture for Avoided Deforestation and Poverty Reduction","NULL","NULL",7,"non-core",0,1]
[909,"Inter-American Development Bank","Banque Interaméricaine de développement",65,"Multidonor AquaFund","Multidonor AquaFund","NULL","NULL",7,"non-core",0,1]
[909,"Inter-American Development Bank","Banque Interaméricaine de développement",66,"AgroLAC 2025 Multidonor Trust Fund","AgroLAC 2025 Multidonor Trust Fund","NULL","NULL",7,"non-core",0,1]
[909,"Inter-American Development Bank","Banque Interaméricaine de développement",67,"Multidonor Fund for Biodiversity and Ecosystem Services","Multidonor Fund for Biodiversity and Ecosystem Services","NULL","NULL",7,"non-core",0,1]
[909,"Inter-American Development Bank","Banque Interaméricaine de développement",68,"Multidonor Fund for Citizen Security","Multidonor Fund for Citizen Security","NULL","NULL",7,"non-core",0,1]
[909,"Inter-American Development Bank","Banque Interaméricaine de développement",69,"Multidonor Disaster Prevention Fund ","Multidonor Disaster Prevention Fund ","NULL","NULL",7,"non-core",0,1]
[909,"Inter-American Development Bank","Banque Interaméricaine de développement",70,"Malaria Elimination Blending Facility","Malaria Elimination Blending Facility","NULL","NULL",7,"non-core",0,1]
[909,"Inter-American Development Bank","Banque Interaméricaine de développement",71,"Multi-Donor Regional Integration Fund","Multi-Donor Regional Integration Fund","NULL","NULL",7,"non-core",0,1]
[909,"Inter-American Development Bank","Banque Interaméricaine de développement",72,"Gender and Diversity Multidonor Fund","Gender and Diversity Multidonor Fund","NULL","NULL",7,"non-core",0,1]
[909,"Inter-American Development Bank","Banque Interaméricaine de développement",73,"Mesoamerica Health Facility","Mesoamerica Health Facility","NULL","NULL",7,"non-core",0,1]
[909,"Inter-American Development Bank","Banque Interaméricaine de développement",74,"Sustainable Energy and Climate Change Multi-donor Trust Fund","Sustainable Energy and Climate Change Multi-donor Trust Fund","NULL","NULL",7,"non-core",0,1]
[909,"Inter-American Development Bank","Banque Interaméricaine de développement",75,"Portuguese Technical Cooperation Trust Fund","Portuguese Technical Cooperation Trust Fund","NULL","NULL",7,"non-core",0,1]
[909,"Inter-American Development Bank","Banque Interaméricaine de développement",76,"Regional Fund for Agriculture Technology","Regional Fund for Agriculture Technology","NULL","NULL",7,"non-core",0,1]
[909,"Inter-American Development Bank","Banque Interaméricaine de développement",77,"Technical Cooperation and Small Projects Swiss Fund","Technical Cooperation and Small Projects Swiss Fund","NULL","NULL",7,"non-core",0,1]
[909,"Inter-American Development Bank","Banque Interaméricaine de développement",78,"Spanish Fund for Water and Sanitation","Spanish Fund for Water and Sanitation","NULL","NULL",7,"non-core",0,1]
[909,"Inter-American Development Bank","Banque Interaméricaine de développement",79,"United Kingdom Sustainable Infrastructure Program","United Kingdom Sustainable Infrastructure Program","NULL","NULL",7,"non-core",0,1]
[909,"Inter-American Development Bank","Banque Interaméricaine de développement",80,"Government of Spain - Quincentennial Fund","Government of Spain - Quincentennial Fund","NULL","NULL",7,"non-core",0,1]
[909,"Inter-American Development Bank","Banque Interaméricaine de développement",81,"Social Progress Trust Fund","Social Progress Trust Fund","SPT","SPT",7,"non-core",0,1]
[909,"Inter-American Development Bank","Banque Interaméricaine de développement",82,"Swiss Technical Cooperation Fund for Consulting Services and Training","Swiss Technical Cooperation Fund for Consulting Services and Training","STC","STC",7,"non-core",0,1]
[909,"Inter-American Development Bank","Banque Interaméricaine de développement",83,"Specialized Financial Intermediary Development Fund","Specialized Financial Intermediary Development Fund","TDF","TDF",7,"non-core",0,1]
[909,"Inter-American Development Bank","Banque Interaméricaine de développement",84,"Specialized Financial Intermediary Development Fund","Specialized Financial Intermediary Development Fund","FMM","FMM",7,"non-core",0,1]
[909,"Inter-American Development Bank","Banque Interaméricaine de développement",85,"Green Climate Fund","Green Climate Fund","GRN","GRN",7,"non-core",0,1]
[909,"Inter-American Development Bank","Banque Interaméricaine de développement",86,"MIF- Clinton Bush Haiti Fund","MIF- Clinton Bush Haiti Fund","MCB","MCB",7,"non-core",0,1]
[909,"Inter-American Development Bank","Banque Interaméricaine de développement",87,"Nordic Development Fund","Nordic Development Fund","NDV","NDV",7,"non-core",0,1]
[909,"Inter-American Development Bank","Banque Interaméricaine de développement",88,"Special Climate Change Fund","Special Climate Change Fund","SCC","SCC",7,"non-core",0,1]
[909,"Inter-American Development Bank","Banque Interaméricaine de développement",89,"Amazon Bioeconomy and Forest Management Fund","Amazon Bioeconomy and Forest Management Fund","AMZ","AMZ",7,"non-core",0,1]
[909,"Inter-American Development Bank","Banque Interaméricaine de développement",90,"UK Blue Carbon Fund","UK Blue Carbon Fund","BLU","BLU",7,"non-core",0,1]
[909,"Inter-American Development Bank","Banque Interaméricaine de développement",91,"Capacity Building Initiative for Transparency Trust Fund","Capacity Building Initiative for Transparency Trust Fund","CBT","CBT",7,"non-core",0,1]
[909,"Inter-American Development Bank","Banque Interaméricaine de développement",92,"Global Concessional Financing Facility Trust Fund","Global Concessional Financing Facility Trust Fund","CFF","CFF",7,"non-core",0,1]
[909,"Inter-American Development Bank","Banque Interaméricaine de développement",93,"Multidonor Trust Fund for the Development of Sustainable Cities in Latin America and the Caribbean","Multidonor Trust Fund for the Development of Sustainable Cities in Latin America and the Caribbean","CIT","CIT",7,"non-core",0,1]
[909,"Inter-American Development Bank","Banque Interaméricaine de développement",94,"Fostering Fiscal Policy for Climate Change in Latin America and the Caribbean","Fostering Fiscal Policy for Climate Change in Latin America and the Caribbean","FFP","FFP",7,"non-core",0,1]
[909,"Inter-American Development Bank","Banque Interaméricaine de développement",95,"French Climate Fund for Latin America and the Caribbean","French Climate Fund for Latin America and the Caribbean","FRC","FRC",7,"non-core",0,1]
[909,"Inter-American Development Bank","Banque Interaméricaine de développement",96,"Development Fund for the Ecuador-Colombia Border Integration Zone","Development Fund for the Ecuador-Colombia Border Integration Zone","ICE","ICE",7,"non-core",0,1]
[909,"Inter-American Development Bank","Banque Interaméricaine de développement",97,"Development Fund for the Colombia-Peru Border Integration Zone","Development Fund for the Colombia-Peru Border Integration Zone","ICP","ICP",7,"non-core",0,1]
[909,"Inter-American Development Bank","Banque Interaméricaine de développement",98,"Low Carbon Energy Fund for People and Planet","Low Carbon Energy Fund for People and Planet","LCE","LCE",7,"non-core",0,1]
[909,"Inter-American Development Bank","Banque Interaméricaine de développement",99,"France-IDB Natural Capital Lab Fund","France-IDB Natural Capital Lab Fund","NCL","NCL",7,"non-core",0,1]
[909,"Inter-American Development Bank","Banque Interaméricaine de développement",100,"Norwegian Grant for Guyana","Norwegian Grant for Guyana","NGG","NGG",7,"non-core",0,1]
[909,"Inter-American Development Bank","Banque Interaméricaine de développement",101,"Nama Facility Account","Nama Facility Account","NMA","NMA",7,"non-core",0,1]
[909,"Inter-American Development Bank","Banque Interaméricaine de développement",102,"Multi-Donor Fund for the Transformation of Technical and Vocational Education and Training","Multi-Donor Fund for the Transformation of Technical and Vocational Education and Training","TVT","TVT",7,"non-core",0,1]
[909,"Inter-American Development Bank","Banque Interaméricaine de développement",103,"Women Entrepreneurs Finance Initiative (We-Fi)","Women Entrepreneurs Finance Initiative (We-Fi)","WEF","WEF",7,"non-core",0,1]
[909,"Inter-American Development Bank","Banque Interaméricaine de développement",104,"Pandemic Prevention Response Fund","Pandemic Prevention Response Fund","PPF","PPF",7,"global",0,1]
[909,"Inter-American Development Bank","Banque Interaméricaine de développement",105,"Framework Readiness Preparatory Support","Framework Readiness Preparatory Support","GRP","GRP",7,"global",0,1]
[909,"Inter-American Development Bank","Banque Interaméricaine de développement",106,"Global Partnership for Education Fund","Global Partnership for Education Fund","GPE","GPE",7,"global",0,1]
[909,"Inter-American Development Bank","Banque Interaméricaine de développement",107,"Project Specific Contribution Account","Project Specific Contribution Account","PSC","PSC",7,null,0,1]
[909,"Inter-American Development Bank","Banque Interaméricaine de développement",108,"Global Environment Facility (GEF)","Global Environment Facility (GEF)","GEF","GEF",51,null,0,1]
[944,"International Atomic Energy Agency","Agence internationale de l'énergie atomique",1,"IAEA","IAEA","NULL","NULL",1,"NULL",1,1]
[901,"International Bank for Reconstruction and Development","Banque internationale pour la reconstruction et le développement",1,"International Bank for Reconstruction and Development","International Bank for Reconstruction and Development","NULL","NULL",99,"NULL",1,1]
[901,"International Bank for Reconstruction and Development","Banque internationale pour la reconstruction et le développement",2,"Multilateral Investment Guarantee Agency","Multilateral Investment Guarantee Agency","NULL","NULL",99,"NULL",1,1]
[901,"International Bank for Reconstruction and Development","Banque internationale pour la reconstruction et le développement",3,"International Finance Corporation","International Finance Corporation","NULL","NULL",1,"NULL",1,1]
[901,"International Bank for Reconstruction and Development","Banque internationale pour la reconstruction et le développement",4,"International Development Association","International Development Association","NULL","NULL",99,"NULL",1,1]
[1052,"International Centre for Genetic Engineering and Biotechnology","Centre international de génie génétique et de biotechnologie",1,"ICGEB Core, developmental","ICGEB Core, developmental","ICGEB","ICGEB",1,", Added 10/02/2023, by Baldock_M (M.Berbegal email of 10/02/2023)",1,1]
[1052,"International Centre for Genetic Engineering and Biotechnology","Centre international de génie génétique et de biotechnologie",2,"ICGEB Core, global activities","ICGEB Core, global activities","NULL","NULL",8,"NULL",0,1]
[1049,"International Commission on Missing Persons","Commission internationale pour les personnes disparues",1,"ICMP core resources","CIPD (financement au budget régulier)","ICMP","CIPD",99,", Added 15/11/2022, by Baldock_M (M.Berbegal email of 14/11/2022)",1,1]
[1049,"International Commission on Missing Persons","Commission internationale pour les personnes disparues",2,"ICMP Non-core resources","ICMP Non-core resources","NULL","NULL",7,"non-core",0,1]
[1037,"International Investment Bank","Banque internationale d'investissement",1,"International Investment Bank","Banque internationale d'investissement","IIB","IIB",1,"NULL",1,1]
[940,"International Labour Organisation","Organisation internationale du Travail",1,"Regular Budget","Regular Budget","RB","RB",1,", Added by MB 2016-05-31, AZ email of 24/05/2016",1,1]
[940,"International Labour Organisation","Organisation internationale du Travail",2,"Regular Budget Technical Cooperation","Regular Budget Technical Cooperation","RBTC","RBTC",1,", Added by MB 2016-05-31, AZ email of 24/05/2016",1,1]
[940,"International Labour Organisation","Organisation internationale du Travail",3,"Regular Budget Supplementary Account","Regular Budget Supplementary Account","RBSA","RBSA",1,", Added by MB 2016-05-31, AZ email of 24/05/2016",1,1]
[940,"International Labour Organisation","Organisation internationale du Travail",4,"Voluntary non-core funding - developmental","Voluntary non-core funding - developmental","NULL","NULL",7,"non-core",0,1]
[940,"International Labour Organisation","Organisation internationale du Travail",5,"Regular Budget - regional and global (non-developmental part)","Regular Budget - regional and global (non-developmental part)","NULL","NULL",8,"NULL",0,1]
[940,"International Labour Organisation","Organisation internationale du Travail",6,"Regular Budget Technical Cooperation - regional and global (non-developmental part)","Regular Budget Technical Cooperation - regional and global (non-developmental part)","NULL","NULL",8,"NULL",0,1]
[940,"International Labour Organisation","Organisation internationale du Travail",7,"Voluntary non-core funding – regional and global (non developmental part)","Voluntary non-core funding – regional and global (non developmental part)","NULL","NULL",8,"NULL",0,1]
[907,"International Monetary Fund","Fond monétaire international",1,"IMF","FMI","IMF","IMF",99,"NULL",1,1]
[976,"Islamic Development Bank","Banque de développement islamique",1,"Ordinary Capital Resources","Ordinary Capital Resources","OCR","OCR",1,"Renamed, mail CS 13-11-2023",1,1]
[976,"Islamic Development Bank","Banque de développement islamique",2,"Awqaf Properties Investment Fund","Awqaf Properties Investment Fund","APIF","APIF",2,"Added, mail CS 13-11-2023",1,1]
[976,"Islamic Development Bank","Banque de développement islamique",3,"Islamic Corporation for the Development of the Private Sector","Islamic Corporation for the Development of the Private Sector","ICD","ICD",2,"Added, mail CS 13-11-2023",1,1]
[976,"Islamic Development Bank","Banque de développement islamique",4,"Islamic solidarity fund for Development","Islamic solidarity fund for Development","ISFD","ISFD",2,"Added, mail CS 13-11-2023",1,1]
[976,"Islamic Development Bank","Banque de développement islamique",5,"International Islamic Trade Finance Corporation","International Islamic Trade Finance Corporation","ITFC","ITFC",2,"Added, mail CS 13-11-2023",1,1]
[976,"Islamic Development Bank","Banque de développement islamique",6,"Special Assistance","Special Assistance","NULL","NULL",2,"Added, mail CS 13-11-2023",1,1]
[976,"Islamic Development Bank","Banque de développement islamique",7,"IsDB Group Science Technology and Innovation","IsDB Group Science Technology and Innovation","STI","STI",2,"Added, mail CS 13-11-2023",1,1]
[976,"Islamic Development Bank","Banque de développement islamique",8,"Trust Fund","Trust Fund","NULL","NULL",2,"Added, mail CS 13-11-2023",1,1]
[976,"Islamic Development Bank","Banque de développement islamique",9,"WAQF","WAQF","WAQF","WAQF",2,"Added, mail CS 13-11-2023",1,1]
[1048,"Joint Sustainable Development Goals Fund","Fonds conjoint des objectifs de développement durable",1,"Joint Sustainable Development Goals Fund","Fonds conjoint des objectifs de développement durable","Joint SDG ","Fonds conj",99,", Added 20/10/2022, by Baldock_M (M.Berbegal email of 20/10/2022)",1,1]
[1048,"Joint Sustainable Development Goals Fund","Fonds conjoint des objectifs de développement durable",2,"TOSSD-only recipients","TOSSD-only recipients","NULL","NULL",8,"Added 21/09/2023 by Thielemans_V (Berbegal_m)",0,1]
[812,"Montreal Protocol","Protocole de Montréal",1,"Montreal Protocol","Protocole de Montréal","NULL","NULL",99,", Added 05/09/2016, by Thielemans_V",1,1]
[104,"Nordic Development Fund","Fonds du dév. nordique",1,"Nordic Development Fund","Nordic Development Fund","NDF","NDF",1,"NULL",1,1]
[104,"Nordic Development Fund","Fonds du dév. nordique",2,"Energy and Environment Partnership Trust Fund","Energy and Environment Partnership Trust Fund","EPP","EPP",10,"core and non-core",1,1]
[1045,"North American Development Bank","North American Development Bank",1,"North American Development Bank","North American Development Bank","NADB","NADB",1,", Added 17/03/2022, by Baldock_M (T.Hos email of 16/03/2022)",1,1]
[1045,"North American Development Bank","North American Development Bank",2,"Community Assistance Program","Community Assistance Program","CAP","CAP",1,", Added 17/03/2022, by Baldock_M (T.Hos email of 16/03/2022)",1,1]
[1045,"North American Development Bank","North American Development Bank",3,"Border Environment Infrastructure Fund","Border Environment Infrastructure Fund","BEIF","BEIF",7,"NULL",0,1]
[951,"OPEC Fund for International Development","Fonds OPEP pour le développement international",1,"OPEC Fund","Fonds OPEP","OPEC Fund","Fonds OPEP",99,", Updated 12/10/2020 by Baldock_M, modified abbreviation (T.Hos email of 12/10/20)",1,1]
[978,"OSCE","OSCE",1,"Organisation for Security and Co-operation in Europe","Organisation pour la sécurité et la coopération en Europe","OSCE","OSCE",1,"Added 15/05/2012 by AZ",1,1]
[1014,"Private Infrastructure Development Group","Groupe du développement des infrastructures privées",1,"Infrastructure Crisis Facility – Debt Pool","Infrastructure Crisis Facility – Debt Pool","ICF - DP","ICF - DP",1,", Added MB 2015-07-31, MM email of 31/7/15",0,1]
[1014,"Private Infrastructure Development Group","Groupe du développement des infrastructures privées",2,"Emerging Africa Infrastructure Fund","Fonds des infrastructures pour l'Afrique émergente","EAIF","EAIF",1,", Added MB 2015-07-31, MM email of 31/7/15",0,1]
[1014,"Private Infrastructure Development Group","Groupe du développement des infrastructures privées",3,"GuarantCo","GuarantCo","NULL","NULL",1,", Added MB 2015-07-31, MM email of 31/7/15",0,1]
[1014,"Private Infrastructure Development Group","Groupe du développement des infrastructures privées",4,"InfraCo Asia","InfraCo Asia","NULL","NULL",1,", Added MB 2018-11-19, Hos_T email of 16/11/18",0,1]
[1014,"Private Infrastructure Development Group","Groupe du développement des infrastructures privées",5,"InfraCo Africa","InfraCo Africa","NULL","NULL",1,", Added MB 2018-11-19, Hos_T email of 16/11/18",0,1]
[1014,"Private Infrastructure Development Group","Groupe du développement des infrastructures privées",6,"GAP","GAP","NULL","NULL",1,", Added MB 2018-11-19, Hos_T email of 16/11/18",0,1]
[1014,"Private Infrastructure Development Group","Groupe du développement des infrastructures privées",7,"Technical Assistance Facility","Technical Assistance Facility","TAF","TAF",1,"NULL",0,1]
[1039,"UN Capital Development Fund","UN Capital Development Fund",1,"Non-core resources","Non-core resources","NULL","NULL",7,"non-core",0,1]
[1039,"UN Capital Development Fund","UN Capital Development Fund",2,"UNCDF","UNCDF","UNCDF","UNCDF",1,"Core resources",1,1]
[1057,"UN Development Coordination Office","ONU-Bureau de la coordination des activités de développement",1,"UNDCO core resources","ONU-BCAD budget régulier","NULL","NULL",99,", Added 20/03/2024, by Baldock_M (A.Bejraoui email of 04/03/2024)",1,1]
[1057,"UN Development Coordination Office","ONU-Bureau de la coordination des activités de développement",2,"Non-core resources - TOSSD only","Non-core resources - TOSSD only","NULL","NULL",8,"non-core",0,1]
[1403,"UN Economic and Social Commission for Western Asia","ONU Commission économique et sociale pour l'Asie occidentale",1,"ESCWA - United Nations Economic and Social Commission for Western Asia","ESCWA - United Nations Economic and Social Commission for Western Asia","ESCWA","ESCWA",99,"NULL",0,1]
[1403,"UN Economic and Social Commission for Western Asia","ONU Commission économique et sociale pour l'Asie occidentale",2,"UNESCWA extra-budgetary non-core funding – developmental","UNESCWA extra-budgetary non-core funding – developmental","NULL","NULL",7,"non-core",0,1]
[1403,"UN Economic and Social Commission for Western Asia","ONU Commission économique et sociale pour l'Asie occidentale",3,"UNESCWA extra-budgetary non-core funding – non-developmental","UNESCWA extra-budgetary non-core funding – non-developmental","NULL","NULL",8,"Global",0,1]
[1038,"UN Institute for Disarmament Research","Institut des Nations unies pour la recherche sur le désarmement",1,"UNIDIR Trust Fund (core resources)","Fonds d'affectation spéciale de l'UNIDIR (financement au budget régulier)","UNIDIR","UNIDIR",1,", Added 08/09/2020, by Baldock_M (M.Berbegal email of 30/07/2020)",1,1]
[1038,"UN Institute for Disarmament Research","Institut des Nations unies pour la recherche sur le désarmement",2,"UNIDIR Trust Fund (non-core resources)","UNIDIR Trust Fund (non-core resources)","NULL","NULL",7,"non-core",0,1]
[1038,"UN Institute for Disarmament Research","Institut des Nations unies pour la recherche sur le désarmement",3,"UNIDIR Trust Fund (core resources) - non-developmental","UNIDIR Trust Fund (core resources) - non-developmental","NULL","NULL",8,"NULL",0,1]
[1038,"UN Institute for Disarmament Research","Institut des Nations unies pour la recherche sur le désarmement",4,"UNIDIR Trust Fund (non-core resources) - non-developmental","UNIDIR Trust Fund (non-core resources) - non-developmental","NULL","NULL",8,"non-core",0,1]
[1040,"UN Office on Drugs and Crime","Office des Nations Unies contre la drogue et le crime",1,"Voluntary non-core funding (developmental)","Voluntary non-core funding (developmental)","NULL","NULL",7,"NULL",0,1]
[1040,"UN Office on Drugs and Crime","Office des Nations Unies contre la drogue et le crime",2,"Voluntary non-core funding (non-developmental)","Voluntary non-core funding (non-developmental)","NULL","NULL",8,"NULL",0,1]
[1040,"UN Office on Drugs and Crime","Office des Nations Unies contre la drogue et le crime",3,"Regular budget (developmental)","Regular budget (developmental)","NULL","NULL",1,"NULL",1,1]
[1040,"UN Office on Drugs and Crime","Office des Nations Unies contre la drogue et le crime",4,"Regular budget (TOSSD only)","Regular budget (TOSSD only)","NULL","NULL",8,null,0,1]
[923,"UN Peacebuilding Fund","Fonds de consolidation de la paix-ONU",1,"UNPBF","FCP-ONU","UNPBF","UNPBF",99,"NULL",1,1]
[1046,"UN Women","ONU Femmes",1,"UN Women","ONU Femmes","UN Women","ONU Femmes",99,", Added 19/09/2022, by Baldock_M (M.Berbegal email of 19/09/2022)",1,1]
[1046,"UN Women","ONU Femmes",2,"Voluntary non-core","Voluntary non-core","NULL","NULL",7,"non-core",0,1]
[1046,"UN Women","ONU Femmes",3,"Single-agency thematic funds","Single-agency thematic funds","NULL","NULL",7,"non-core",0,1]
[1046,"UN Women","ONU Femmes",4,"Voluntary core – global and TOSSD-only recipients","Voluntary core – global and TOSSD-only recipients","NULL","NULL",8,"non-core",0,1]
[1046,"UN Women","ONU Femmes",5,"Voluntary Non-Core – global and TOSSD-only recipients","Voluntary Non-Core – global and TOSSD-only recipients","NULL","NULL",8,"non-core",0,1]
[1046,"UN Women","ONU Femmes",6,"Single-agency thematic funds - global and TOSSD-only recipients","Single-agency thematic funds - global and TOSSD-only recipients","NULL","NULL",8,"non-core",0,1]
[971,"UNAIDS","UNAIDS",1,"UNAIDS","UNAIDS","UNAIDS","UNAIDS",99,"NULL",1,1]
[971,"UNAIDS","UNAIDS",2,"Voluntary non-core funding","Voluntary non-core funding","NULL","NULL",7,"non-core",0,1]
[971,"UNAIDS","UNAIDS",3,"Core resources  - global and TOSSD only","Core resources  - global and TOSSD only","NULL","NULL",8,"non-core",0,1]
[971,"UNAIDS","UNAIDS",4,"Voluntary non-core funding - global and TOSSD-only","Voluntary non-core funding - global and TOSSD-only","NULL","NULL",8,"non-core",0,1]
[959,"UNDP","PNUD",1,"UNDP","PNUD","UNDP","UNDP",99,"NULL",1,1]
[959,"UNDP","PNUD",2,"Voluntary non-core funding","Voluntary non-core funding","NULL","NULL",7,"non-core",0,1]
[959,"UNDP","PNUD",3,"UNDP- Global and regional activities","UNDP- Global and regional activities","NULL","NULL",8,"NULL",0,1]
[959,"UNDP","PNUD",4,"Global Environment Facility","Global Environment Facility","GEF","GEF",51,"GEF",0,1]
[948,"UNECE","CEE-ONU",1,"UNECE","UNECE","UNECE","UNECE",99,"NULL",1,1]
[948,"UNECE","CEE-ONU",2,"Voluntary non-core","Voluntary non-core","NULL","NULL",7,"non-core",0,1]
[807,"UNEP","PNUE",1,"Assessed contributions - UN regular budget","Assessed contributions - UN regular budget","UNEP - Assessed Contributions","UNEP - Assessed Contributions",99,"added, AB email 2024-02-07",1,1]
[807,"UNEP","PNUE",2,"Environment Fund","Environment Fund","UNEP - EF","UNEP - EF",1,"added, AB email 2024-02-07",1,1]
[807,"UNEP","PNUE",3,"Multilateral Fund under the Montreal Protocol on Substances that Deplete the Ozone Layer","Multilateral Fund under the Montreal Protocol on Substances that Deplete the Ozone Layer","UNEP - MFMP","UNEP - MFMP",2,"added, AB email 2024-02-07",1,1]
[807,"UNEP","PNUE",4,"Convention on International Trade in Endangered Species of Wild Fauna and Flora (CITES) - Assessed contributions","Convention on International Trade in Endangered Species of Wild Fauna and Flora (CITES) - Assessed contributions","CITES POW Assessed Contributions","CITES POW Assessed Contributions",2,"added, AB email 2024-02-07",1,1]
[807,"UNEP","PNUE",5,"Convention on International Trade in Endangered Species of Wild Fauna and Flora (CITES) - Voluntary Contributions Non-core - developmental","Convention on International Trade in Endangered Species of Wild Fauna and Flora (CITES) - Voluntary Contributions Non-core - developmental","CITES POW Non-core - developmental","CITES POW Non-core - developmental",7,"added, AB email 2024-02-07",0,1]
[807,"UNEP","PNUE",6,"Convention on International Trade in Endangered Species of Wild Fauna and Flora (CITES) - Voluntary Contributions Non-Core - TOSSD only","Convention on International Trade in Endangered Species of Wild Fauna and Flora (CITES) - Voluntary Contributions Non-Core - TOSSD only","CITES POW Non-core - TOSSD only","CITES POW Non-core - TOSSD only",8,"added, AB email 2024-02-07",0,1]
[807,"UNEP","PNUE",7,"UNEP programme support","UNEP programme support","UNEP programme support","UNEP programme support",8,"added, AB email 2024-02-08",0,1]
[807,"UNEP","PNUE",8,"Other Support to UNEP POW","Other Support to UNEP POW","Other Support - developmental","Other Support - developmental",7,"added, AB email 2024-02-09",0,1]
[807,"UNEP","PNUE",9,"Other Support to UNEP POW","Other Support to UNEP POW","Other Support - TOSSD-only","Other Support - TOSSD-only",8,"added, AB email 2024-02-10",0,1]
[807,"UNEP","PNUE",10,"Basel, Rotterdam and Stockholm conventions (BRS)- assessed contributions","Basel, Rotterdam and Stockholm conventions (BRS)- assessed contributions","BRS POW Assessed Contributions","BRS POW Assessed Contributions",8,"added, AB email 2024-02-11",0,1]
[807,"UNEP","PNUE",11,"Basel, Rotterdam and Stockholm conventions (BRS) - Voluntary Contributions Non-core - developmental","Basel, Rotterdam and Stockholm conventions (BRS) - Voluntary Contributions Non-core - developmental","BRS POW Non-core - developmental","BRS POW Non-core - developmental",7,"added, AB email 2024-02-12",0,1]
[807,"UNEP","PNUE",12,"Basel, Rotterdam and Stockholm conventions (BRS) - Voluntary Contributions Non-core TOSSD only","Basel, Rotterdam and Stockholm conventions (BRS) - Voluntary Contributions Non-core TOSSD only","BRS POW Non-core - TOSSD only","BRS POW Non-core - TOSSD only",8,"added, AB email 2024-02-13",0,1]
[807,"UNEP","PNUE",13,"Convention on Migratory Species (CMS) - assessed contributions","Convention on Migratory Species (CMS) - assessed contributions","CMS POW Assessed Contributions","CMS POW Assessed Contributions",8,"added, AB email 2024-02-14",0,1]
[807,"UNEP","PNUE",14,"Convention on Migratory Species (CMS) - Voluntary Contributions Non-core developmental","Convention on Migratory Species (CMS) - Voluntary Contributions Non-core developmental","CMS POW Non-core - developmental","CMS POW Non-core - developmental",7,"added, AB email 2024-02-15",0,1]
[807,"UNEP","PNUE",15,"Convention on Migratory Species (CMS) - Voluntary Contributions Non-core TOSSD only","Convention on Migratory Species (CMS) - Voluntary Contributions Non-core TOSSD only","CMS POW No-core - TOSSD only","CMS POW No-core - TOSSD only",8,"added, AB email 2024-02-16",0,1]
[807,"UNEP","PNUE",16,"Bamako Convention - Assessed Contribution","Bamako Convention - Assessed Contribution","Bamako POW Assessed Contributions","Bamako POW Assessed Contributions",7,"added, AB email 2024-02-17",0,1]
[807,"UNEP","PNUE",17,"Bamako Convention - Voluntary Non-Core Contributions","Bamako Convention - Voluntary Non-Core Contributions","Bamako POW Non-core","Bamako POW Non-core",7,"added, AB email 2024-02-18",0,1]
[807,"UNEP","PNUE",18,"Carpathian Convention - assessed","Carpathian Convention - assessed","CAP POW Assessed Contributions","CAP POW Assessed Contributions",8,"added, AB email 2024-02-19",0,1]
[807,"UNEP","PNUE",19,"Carpathian Convention - Voluntary Contributions Non-core developmental","Carpathian Convention - Voluntary Contributions Non-core developmental","CAP POW Non-core - developmental","CAP POW Non-core - developmental",7,"added, AB email 2024-02-20",0,1]
[807,"UNEP","PNUE",20,"Carpathian Convention - Voluntary Contributions Non-Core - TOSSD only","Carpathian Convention - Voluntary Contributions Non-Core - TOSSD only","CAP POWNon-core - TOSSD oonly","CAP POWNon-core - TOSSD oonly",8,"added, AB email 2024-02-21",0,1]
[807,"UNEP","PNUE",21,"Action Plan for the Caribbean Environment Programme - assessed","Action Plan for the Caribbean Environment Programme - assessed","CAR RCU POW Assessed Contributions","CAR RCU POW Assessed Contributions",8,"added, AB email 2024-02-22",0,1]
[807,"UNEP","PNUE",22,"Action Plan for the Caribbean Environment Programme - Voluntary Contributions Non-core - developmental","Action Plan for the Caribbean Environment Programme - Voluntary Contributions Non-core - developmental","CAR RCU POW Non-core - developmental","CAR RCU POW Non-core - developmental",7,"added, AB email 2024-02-23",0,1]
[807,"UNEP","PNUE",23,"Action Plan for the Caribbean Environment Programme - Voluntary Contributions Non-Core - TOSSD only","Action Plan for the Caribbean Environment Programme - Voluntary Contributions Non-Core - TOSSD only","CAR RCU POWNon-core - TOSSD only","CAR RCU POWNon-core - TOSSD only",8,"added, AB email 2024-02-24",0,1]
[807,"UNEP","PNUE",24,"Intergovernmental Science-Policy Platform on Biodiversity and Ecosystem Services (IPBES) - Voluntary Contributions Non-core - developmental","Intergovernmental Science-Policy Platform on Biodiversity and Ecosystem Services (IPBES) - Voluntary Contributions Non-core - developmental","IPBES POWNon-core - developmental","IPBES POWNon-core - developmental",7,"added, AB email 2024-02-25",0,1]
[807,"UNEP","PNUE",25,"Intergovernmental Science-Policy Platform on Biodiversity and Ecosystem Services - (IPBES) Voluntary Contributions Non-core - TOSSD only","Intergovernmental Science-Policy Platform on Biodiversity and Ecosystem Services - (IPBES) Voluntary Contributions Non-core - TOSSD only","IPBES POW Non-core - TOSSD only","IPBES POW Non-core - TOSSD only",8,"added, AB email 2024-02-26",0,1]
[807,"UNEP","PNUE",26,"Mediterranean Action Plan (MAP) - Assessed contributions - developmental","Mediterranean Action Plan (MAP) - Assessed contributions - developmental","MAP POW Assessed- developmental","MAP POW Assessed- developmental",7,"added, AB email 2024-02-27",0,1]
[807,"UNEP","PNUE",27,"Mediterranean Action Plan (MAP) - Voluntary Contributions Non-core - TOSSD only","Mediterranean Action Plan (MAP) - Voluntary Contributions Non-core - TOSSD only","MAP POW Assessed - TOSSD only","MAP POW Assessed - TOSSD only",8,"added, AB email 2024-02-28",0,1]
[807,"UNEP","PNUE",28,"Mediterranean Action Plan (MAP) - Voluntary Contributions Non-core - developmental","Mediterranean Action Plan (MAP) - Voluntary Contributions Non-core - developmental","MAP POW Non-core - developmental","MAP POW Non-core - developmental",7,"added, AB email 2024-02-29",0,1]
[807,"UNEP","PNUE",29,"Mediterranean Action Plan (MAP) - Voluntary Contributions Non-core - TOSSD only","Mediterranean Action Plan (MAP) - Voluntary Contributions Non-core - TOSSD only","MAP POWs Non-core - TOSSD only","MAP POWs Non-core - TOSSD only",8,"added, AB email 2024-02-30",0,1]
[807,"UNEP","PNUE",30,"Minamata Convention on Mercury (MCV) - Assessed Contributions","Minamata Convention on Mercury (MCV) - Assessed Contributions","MCV POW Assessed Contributions","MCV POW Assessed Contributions",8,"added, AB email 2024-02-31",0,1]
[807,"UNEP","PNUE",31,"Minamata Convention on Mercury (MCV) - Voluntary Contributions Non-core - developmental","Minamata Convention on Mercury (MCV) - Voluntary Contributions Non-core - developmental","MCV POW Non-core - developmental","MCV POW Non-core - developmental",7,"added, AB email 2024-02-32",0,1]
[807,"UNEP","PNUE",32,"Minamata Convention on Mercury (MCV) - Voluntary Contributions Non-core - TOSSD only","Minamata Convention on Mercury (MCV) - Voluntary Contributions Non-core - TOSSD only","MCV POW Non-core - TOSSD only","MCV POW Non-core - TOSSD only",8,"added, AB email 2024-02-33",0,1]
[807,"UNEP","PNUE",33,"Northwest Pacific Action Plan (NOWPAP) - Assessed Contributions - developmental","Northwest Pacific Action Plan (NOWPAP) - Assessed Contributions - developmental","NOWPAP POW Assessed - developmental","NOWPAP POW Assessed - developmental",7,"added, AB email 2024-02-34",0,1]
[807,"UNEP","PNUE",34,"Northwest Pacific Action Plan (NOWPAP) - Assessed Contributions - TOSSD only","Northwest Pacific Action Plan (NOWPAP) - Assessed Contributions - TOSSD only","NOWPAP POW Assessed - TOSSD only","NOWPAP POW Assessed - TOSSD only",8,"added, AB email 2024-02-35",0,1]
[807,"UNEP","PNUE",35,"Northwest Pacific Action Plan (NOWPAP) - Voluntary Contributions Non-core - developmental","Northwest Pacific Action Plan (NOWPAP) - Voluntary Contributions Non-core - developmental","NOWPAP POW Non-core - developmental","NOWPAP POW Non-core - developmental",7,"added, AB email 2024-02-36",0,1]
[807,"UNEP","PNUE",36,"Northwest Pacific Action Plan (NOWPAP) - Voluntary Contributions Non-core - TOSSD only","Northwest Pacific Action Plan (NOWPAP) - Voluntary Contributions Non-core - TOSSD only","NOWPAP POW Non-core - TOSSD only","NOWPAP POW Non-core - TOSSD only",8,"added, AB email 2024-02-37",0,1]
[807,"UNEP","PNUE",37,"Ozone Treaties (Montreal Protocol and Vienna Convention) - Assessed Contributions - developmental","Ozone Treaties (Montreal Protocol and Vienna Convention) - Assessed Contributions - developmental","Ozone POW Assessed - developmental","Ozone POW Assessed - developmental",7,"added, AB email 2024-02-38",0,1]
[807,"UNEP","PNUE",38,"Ozone Treaties (Montreal Protocol and Vienna Convention) - Assessed Contributions - TOSSD only","Ozone Treaties (Montreal Protocol and Vienna Convention) - Assessed Contributions - TOSSD only","Ozone POW Assessed - TOSSD only","Ozone POW Assessed - TOSSD only",8,"added, AB email 2024-02-39",0,1]
[807,"UNEP","PNUE",39,"Ozone Treaties (Montreal Protocol and Vienna Convention)  - Voluntary Contributions Non-core - developmental","Ozone Treaties (Montreal Protocol and Vienna Convention)  - Voluntary Contributions Non-core - developmental","Ozone POW Non-core - developmental","Ozone POW Non-core - developmental",7,"added, AB email 2024-02-40",0,1]
[807,"UNEP","PNUE",40,"Ozone Treaties (Montreal Protocol and Vienna Convention)  - Voluntary Contributions Non-core - TOSSD only","Ozone Treaties (Montreal Protocol and Vienna Convention)  - Voluntary Contributions Non-core - TOSSD only","Ozone POW Non-core - TOSSD only","Ozone POW Non-core - TOSSD only",8,"added, AB email 2024-02-41",0,1]
[807,"UNEP","PNUE",41,"Convention for the Marine and Coastal Environment of the Atlantic Coast of the West, Central and Southern Africa Region - Assessed Contributions","Convention for the Marine and Coastal Environment of the Atlantic Coast of the West, Central and Southern Africa Region - Assessed Contributions","RSAS POW Assessed Contributions","RSAS POW Assessed Contributions",7,"added, AB email 2024-02-42",0,1]
[807,"UNEP","PNUE",42,"Convention for the Marine and Coastal Environment of the Atlantic Coast of the West, Central and Southern Africa Region - Non-core","Convention for the Marine and Coastal Environment of the Atlantic Coast of the West, Central and Southern Africa Region - Non-core","RSAS POW Non-core","RSAS POW Non-core",7,"added, AB email 2024-02-43",0,1]
[807,"UNEP","PNUE",43,"Convention on Biological Diversity (CBD) - Assessed Contributions","Convention on Biological Diversity (CBD) - Assessed Contributions","SCBD POW Assessed Contributions","SCBD POW Assessed Contributions",8,"added, AB email 2024-02-44",0,1]
[807,"UNEP","PNUE",44,"Convention on Biological Diversity (CBD) - Voluntary Contributions Non-core - developmental","Convention on Biological Diversity (CBD) - Voluntary Contributions Non-core - developmental","SCBD POW Non-core - developmental","SCBD POW Non-core - developmental",7,"added, AB email 2024-02-45",0,1]
[807,"UNEP","PNUE",45,"Convention on Biological Diversity (CBD) - Voluntary Contributions Non-core - TOSSD only","Convention on Biological Diversity (CBD) - Voluntary Contributions Non-core - TOSSD only","SCBD POW Non-core - TOSSD only","SCBD POW Non-core - TOSSD only",8,"added, AB email 2024-02-46",0,1]
[807,"UNEP","PNUE",46,"UNEP, core and earmarked, developmental","UNEP, core and earmarked, developmental","NULL","NULL",8,"recoded 2 to 46, AB email 2024-02-07",0,1]
[807,"UNEP","PNUE",48,"Global Environment Facility","Global Environment Facility","GEF","GEF",51,"added, TH email 10/12/2025",0,1]
[974,"UNFPA","FNUAP",1,"UNFPA","UNFPA","UNFPA","UNFPA",99,"NULL",1,1]
[974,"UNFPA","FNUAP",2,"Voluntary non-core funding","Voluntary non-core funding","NULL","NULL",7,"non-core",0,1]
[974,"UNFPA","FNUAP",3,"Core resources  - global and TOSSD only recipients","Core resources  - global and TOSSD only recipients","NULL","NULL",8,null,0,1]
[974,"UNFPA","FNUAP",4,"Voluntary non-core funding - global and TOSSD-only recipients","Voluntary non-core funding - global and TOSSD-only recipients","NULL","NULL",8,null,0,1]
[967,"UNHCR","HCR",1,"United Nations High Commissioner for Refugees","HCR","UNHCR","UNHCR",99,"Added by FD 2012-11-29",1,1]
[967,"UNHCR","HCR",2,"Voluntary non-core funding","Voluntary non-core funding","NULL","NULL",7,"non-core",0,1]
[963,"UNICEF","UNICEF",1,"UNICEF","UNICEF","UNICEF","UNICEF",1,"NULL",1,1]
[963,"UNICEF","UNICEF",2,"Voluntary non-core funding","Voluntary non-core funding","NULL","NULL",7,"non-core",0,1]
[962,"United Nations Conference on Trade and Development","Conférence des Nations Unies sur le commerce et le développement",1,"Voluntary earmarked resources","Voluntary earmarked resources","NULL","NULL",7,"non-core",0,1]
[962,"United Nations Conference on Trade and Development","Conférence des Nations Unies sur le commerce et le développement",2,"United Nations Conference on Trade and Development - Regular budget","Conférence des Nations Unies sur le commerce et le développement - budget régulier","UNCTAD","CNUCED",99,"NULL",1,1]
[1406,"United Nations Industrial Development Organization","ONUDI",1,"UNIDO","UNIDO","UNIDO","UNIDO",99,"NULL",1,1]
[1406,"United Nations Industrial Development Organization","ONUDI",2,"Extrabudgetary non-core resources","Extrabudgetary non-core resources","NULL","NULL",7,"non-core",0,1]
[1406,"United Nations Industrial Development Organization","ONUDI",3,"Extrabudgetary non-core resources – global and TOSSD only","Extrabudgetary non-core resources – global and TOSSD only","NULL","NULL",8,"non-core",0,1]
[1406,"United Nations Industrial Development Organization","ONUDI",4,"Global Environment Facility","Global Environment Facility","GEF","GEF",51,"GEF",0,1]
[964,"UNRWA","UNRWA",1,"UNRWA","UNRWA","UNRWA","UNRWA",99,"NULL",1,1]
[964,"UNRWA","UNRWA",2,"Voluntary non-core funding","Voluntary non-core funding","NULL","NULL",7,"non-core",0,1]
[966,"WFP","PAM",1,"WFP","FMA","WFP","WFP",99,"NULL",1,1]
[966,"WFP","PAM",2,"Voluntary non-core funding","Voluntary non-core funding","NULL","NULL",7,"non-core",0,1]
[1050,"WHO-Strategic Preparedness and Response Plan","OMS-Plan stratégique de préparation et de réponse",1,"SPRP–Developmental","PSPR-Développement","SPRP","PSPR",1,", Added 02/12/2022, by Baldock_M (M.Berbegal email of 22/11/2022)",1,1]
[1050,"WHO-Strategic Preparedness and Response Plan","OMS-Plan stratégique de préparation et de réponse",2,"SPRP Developmental, earmarked resources","SPRP Developmental, earmarked resources","NULL","NULL",7,"NULL",0,1]
[1050,"WHO-Strategic Preparedness and Response Plan","OMS-Plan stratégique de préparation et de réponse",3,"SPRP - Developmental TOSSD recipients only","SPRP - Developmental TOSSD recipients only","NULL","NULL",8,"NULL",0,1]
[1050,"WHO-Strategic Preparedness and Response Plan","OMS-Plan stratégique de préparation et de réponse",4,"SPRP – Global and regional activities","SPRP – Global and regional activities","NULL","NULL",8,"NULL",0,1]
[928,"World Health Organisation","Organisation mondiale de la santé",1,"WHO","WHO","WHO","WHO",99,"NULL",1,1]
[928,"World Health Organisation","Organisation mondiale de la santé",2,"WHO Assessed contributions","WHO Assessed contributions","AC","AC",1,"NULL",1,1]
[928,"World Health Organisation","Organisation mondiale de la santé",3,"WHO Core Voluntary contributions","WHO Core Voluntary contributions","CVCA","CVCA",1,"NULL",1,1]
[928,"World Health Organisation","Organisation mondiale de la santé",4,"In-kind contributions","In-kind contributions","NULL","NULL",7,"non-core",0,1]
[928,"World Health Organisation","Organisation mondiale de la santé",5,"Voluntary contributions","Voluntary contributions","NULL","NULL",7,"non-core",0,1]
[928,"World Health Organisation","Organisation mondiale de la santé",6,"WHO - regional and global (non-developmental)","WHO - regional and global (non-developmental)","NULL","NULL",8,"NULL",0,1]
[928,"World Health Organisation","Organisation mondiale de la santé",7,"WHO Assessed contributions - regional and global (non-developmental)","WHO Assessed contributions - regional and global (non-developmental)","NULL","NULL",8,"NULL",0,1]
[928,"World Health Organisation","Organisation mondiale de la santé",8,"WHO Core Voluntary contributions - regional and global (non-developmental)","WHO Core Voluntary contributions - regional and global (non-developmental)","NULL","NULL",8,"NULL",0,1]
[928,"World Health Organisation","Organisation mondiale de la santé",9,"In-kind contributions - regional and global (non-developmental)","In-kind contributions - regional and global (non-developmental)","NULL","NULL",8,"NULL",0,1]
[928,"World Health Organisation","Organisation mondiale de la santé",10,"Voluntary contributions - regional and global (non-developmental)","Voluntary contributions - regional and global (non-developmental)","NULL","NULL",8,"NULL",0,1]
[928,"World Health Organisation","Organisation mondiale de la santé",11,"WHO Framework Convention on Tobacco Control","WHO Framework Convention on Tobacco Control","FCTC","FCTC",7,"Added 21/09/2023 by Thielemans_V (Bejraoui_a)",0,1]
[928,"World Health Organisation","Organisation mondiale de la santé",12,"WHO Framework Convention on Tobacco Control – non-developmental","WHO Framework Convention on Tobacco Control – non-developmental","FCTC – ND","FCTC – ND",8,"Added 21/09/2023 by Thielemans_V (Bejraoui_a)",0,1]
[928,"World Health Organisation","Organisation mondiale de la santé",13,"European Observatory of Health Systems","European Observatory of Health Systems","EOHS","EOHS",8,"Added 21/09/2023 by Thielemans_V (Bejraoui_a)",0,1]
[928,"World Health Organisation","Organisation mondiale de la santé",14,"Partnership for Maternal, Newborn & Child Health","Partnership for Maternal, Newborn & Child Health","PMNCH","PMNCH",7,"Added 21/09/2023 by Thielemans_V (Bejraoui_a)",0,1]
[928,"World Health Organisation","Organisation mondiale de la santé",15,"Alliance for Health Policy and Systems Research","Alliance for Health Policy and Systems Research","AHPSR","AHPSR",8,"Added 21/09/2023 by Thielemans_V (Bejraoui_a)",0,1]
[928,"World Health Organisation","Organisation mondiale de la santé",16,"Expanded Special Project for Elimination of Neglected Tropical Disease","Expanded Special Project for Elimination of Neglected Tropical Disease","ESPEN","ESPEN",7,"Added 21/09/2023 by Thielemans_V (Bejraoui_a)",0,1]
[1054,"World Organisation for Animal Health","Organisation mondiale de la santé animale",1,"Statutory contribution (General budget) - Developmental","Contribution statutaire (Budget général) - dévelopemental","NULL","NULL",1,", Added 02/06/2023, by Baldock_M (M.Berbegal email of 31/05/2023)",1,1]
[1054,"World Organisation for Animal Health","Organisation mondiale de la santé animale",2,"Statutory contribution and voluntary contributions from host country (WOAH Regional Representations) - Developmental","Contribution statutaire et contributions volontaires du pays hôte (représentations régionales de WOAH) - dévelopemental","NULL","NULL",1,", Added 02/06/2023, by Baldock_M (M.Berbegal email of 31/05/2023)",1,1]
[1054,"World Organisation for Animal Health","Organisation mondiale de la santé animale",3,"World Animal Health and Welfare Fund (World Fund)","World Animal Health and Welfare Fund (World Fund)","NULL","NULL",7,"non-core",0,1]
[1054,"World Organisation for Animal Health","Organisation mondiale de la santé animale",4,"Statutory contribution (General Budget) – Global","Statutory contribution (General Budget) – Global","NULL","NULL",8,"NULL",0,1]
[1054,"World Organisation for Animal Health","Organisation mondiale de la santé animale",5,"Statutory contribution and voluntary contribution from WOAH Regional Representations – Global","Statutory contribution and voluntary contribution from WOAH Regional Representations – Global","NULL","NULL",8,"NULL",0,1]
[1023,"World Tourism Organisation","Organisation mondiale du tourisme",1,"UNWTO-Regular Budget","UNWTO-Regular Budget","UNWTO-RB","UNWTO-RB",99,", Added 04/12/2017, by Baldock_M (A.Zimmerman email of 30/11/2017)",1,1]
[1023,"World Tourism Organisation","Organisation mondiale du tourisme",2,"UNWTO-Extra-Budgetary Project","UNWTO-Extra-Budgetary Project","UNWTO-XBP","UNWTO-XBP",7,"non-core",0,1]
[1023,"World Tourism Organisation","Organisation mondiale du tourisme",3,"UNWTO-Extra-Budgetary Project In-Kind","UNWTO-Extra-Budgetary Project In-Kind","UNWTO-XBPI","UNWTO-XBPI",7,"non-core",0,1]
[1023,"World Tourism Organisation","Organisation mondiale du tourisme",4,"Voluntary non-core funding","Voluntary non-core funding","NULL","NULL",7,"non-core",0,1]
[1404,"World Trade Organisation","Organisation mondiale du commerce",1,"WTO - World Trade Organization","OMC – Organisation Mondiale du Commerce","WTO","OMC",99,"NULL",1,1]
[1404,"World Trade Organisation","Organisation mondiale du commerce",2,"WTO – non-core resources","WTO – non-core resources","NULL","NULL",7,"NULL",0,1]
[1404,"World Trade Organisation","Organisation mondiale du commerce",3,"WTO – TOSSD only recipient (core and non-core)","WTO – TOSSD only recipient (core and non-core)","NULL","NULL",8,"NULL",0,1]
[1404,"World Trade Organisation","Organisation mondiale du commerce",4,"WTO Global Trust Fund","WTO Global Trust Fund","NULL","NULL",1,"NULL",1,1]
[1401,"WTO - International Trade Centre","Centre du commerce international de l'OMC",1,"International Trade Centre - Regular budget","International Trade Centre - Regular budget","ITC","ITC",99,"NULL",1,1]
[1401,"WTO - International Trade Centre","Centre du commerce international de l'OMC",2,"Voluntary non-core funding","Voluntary non-core funding","NULL","NULL",7,"NULL",0,1]
[1401,"WTO - International Trade Centre","Centre du commerce international de l'OMC",3,"VC unearmarked ","VC unearmarked ","NULL","NULL",99,"NULL",1,1]
[1401,"WTO - International Trade Centre","Centre du commerce international de l'OMC",4,"Voluntary non-core funding, TOSSD-only activities","Voluntary non-core funding, TOSSD-only activities","NULL","NULL",8,"NULL",0,1]
[1401,"WTO - International Trade Centre","Centre du commerce international de l'OMC",5,"VC unearmarked, TOSSD-only activities","VC unearmarked, TOSSD-only activities","NULL","NULL",8,"NULL",0,1]
[301,"Canada",8,"Royal Canadian Mounted Police of Canada","RCMP",2,"Other Extending Aid Agencies"]
[301,"Canada",9,"Provincial Governments and municipalities","GOV",3,"Local Governments"]
[301,"Canada",10,"Immigration, Refugees and Citizenship Canada","IRCC",99,"Unknown"]
[301,"Canada",11,"Environment and Climate Change Canada","ECCC",99,"Unknown"]
[301,"Canada",22,"FinDev Canada","FinDev",5,"Development Finance Institutions"]
[301,"Canada",31,"Export Development Canada","EDC",4,"Export Credit Agencies"]
[301,"Canada",99,"Miscellaneous","MISC",2,"Other Extending Aid Agencies"]
[302,"United States",1,"Agency for International Development","AID",1,"Main Aid Agencies (in terms of budget)"]
[302,"United States",2,"Department of Agriculture","AGR",2,"Other Extending Aid Agencies"]
[302,"United States",6,"Department of the Treasury","DTRE",2,"Other Extending Aid Agencies"]
[302,"United States",7,"Department of Defense","DOD",2,"Other Extending Aid Agencies"]
[302,"United States",9,"Department of the Interior","INT",2,"Other Extending Aid Agencies"]
[302,"United States",10,"Peace Corps","PEACE",2,"Other Extending Aid Agencies"]
[302,"United States",11,"State Department","STATE",2,"Other Extending Aid Agencies"]
[302,"United States",12,"Trade and Development Agency","TDA",2,"Other Extending Aid Agencies"]
[302,"United States",13,"African Development Foundation","ADF",2,"Other Extending Aid Agencies"]
[302,"United States",14,"Department of Health and Human Services","HHS",2,"Other Extending Aid Agencies"]
[302,"United States",15,"Department of Justice","JUSTICE",2,"Other Extending Aid Agencies"]
[302,"United States",16,"Department of Commerce","COMMERCE",2,"Other Extending Aid Agencies"]
[302,"United States",17,"Department of Labor","LABOR",2,"Other Extending Aid Agencies"]
[302,"United States",18,"Millennium Challenge Corporation","MCC",1,"Main Aid Agencies (in terms of budget)"]
[302,"United States",19,"Department of Homeland Security","DHS",2,"Other Extending Aid Agencies"]
[302,"United States",20,"Department of Energy","DOE",2,"Other Extending Aid Agencies"]
[302,"United States",21,"Inter-American Development Foundation","IADF",1,"Main Aid Agencies (in terms of budget)"]
[302,"United States",22,"Overseas Private Investment Corporation","OPIC",5,"Development Finance Institutions"]
[302,"United States",23,"Federal Trade Commission","FTC",2,"Other Extending Aid Agencies"]
[302,"United States",26,"Department of Transportation","DOT",2,"Other Extending Aid Agencies"]
[302,"United States",28,"Open World Leadership Center","LIC",2,"Other Extending Aid Agencies"]
[302,"United States",31,"Export Import Bank","EXIM",4,"Export Credit Agencies"]
[302,"United States",32,"Environmental Protection Agency","EPA",2,"Other Extending Aid Agencies"]
[302,"United States",34,"International Development Finance Corporation","DFC",5,"Development Finance Institutions"]
[302,"United States",35,"National Aeronautics and Space Administration","NASA",2,"Other Extending Aid Agencies"]
[302,"United States",40,"Private flows","PRIVATE",2,"Other Extending Aid Agencies"]
[302,"United States",99,"Miscellaneous","MISC",2,"Other Extending Aid Agencies"]
[336,"Costa Rica",1,"International Cooperation Area (ACI) of MIDEPLAN",null,99,"Unknown"]
[336,"Costa Rica",2,"Ministry of Public Education (MEP)",null,99,"Unknown"]
[336,"Costa Rica",3,"Costa Rican Institute of Electricity (ICE)",null,99,"Unknown"]
[336,"Costa Rica",4,"Children’s Board of Costa Rica (PANI)",null,99,"Unknown"]
[336,"Costa Rica",5,"Ministry of Health (MINSA)",null,99,"Unknown"]
[336,"Costa Rica",6,"Deputy Ministry of Environment, National System of Conservation Areas (SINAC)",null,99,"Unknown"]
[336,"Costa Rica",7,"Local government ",null,99,"Unknown"]
[336,"Costa Rica",8,"Academia",null,99,"Unknown"]
[336,"Costa Rica",9,"National Women Institute",null,99,"Unknown"]
[336,"Costa Rica",10,"Judicial Branch",null,99,"Unknown"]
[336,"Costa Rica",11,"Mixes Social Aid Institute",null,99,"Unknown"]
[336,"Costa Rica",12,"General Directorate of Migration",null,99,"Unknown"]
[336,"Costa Rica",99,"Other",null,99,"Unknown"]
[340,"Dominican Republic",1,"Ministry of Economy, Plannning and Development","MEPyD",99,"Unknown"]
[340,"Dominican Republic",2,"Ministry of Foreign Affairs","MIREX",99,"Unknown"]
[340,"Dominican Republic",3,"Ministry of Culture","CULTURA",99,"Unknown"]
[340,"Dominican Republic",4,"Ministry of Environment and Natural Resources","MARENA",99,"Unknown"]
[340,"Dominican Republic",5,"Ministry of Labour","MIT",99,"Unknown"]
[340,"Dominican Republic",6,"Ministry of Tourism","MITUR",99,"Unknown"]
[340,"Dominican Republic",7,"Ministry of Women","MMUJER",99,"Unknown"]
[340,"Dominican Republic",8,"Attorney General's Office","PGR",99,"Unknown"]
[340,"Dominican Republic",9,"Ministry of Higher Education, Science and Technology","MESCYT",99,"Unknown"]
[340,"Dominican Republic",10,"Ministry of Public Works and Communications","MOPC",99,"Unknown"]
[340,"Dominican Republic",99,"Others","Others",99,"Unknown"]
[347,"Guatemala",1,"Secretariat of Planning and Programming of the Presidency","SEGEPLAN",99,"Unknown"]
[358,"Mexico",1,"Mexican Agency for International Development Cooperation","AMEXCID",1,"Main Aid Agencies (in terms of budget)"]
[358,"Mexico",2,"Ministry of Foreign Affairs","SRE",2,"Other Extending Aid Agencies"]
[358,"Mexico",3,"Ministry of Defence","SEDENA",2,"Other Extending Aid Agencies"]
[358,"Mexico",4,"Ministry of Finance and Public Credit","SHCP",2,"Other Extending Aid Agencies"]
[358,"Mexico",5,"Ministry of  Welfare","SEBIEN",2,"Other Extending Aid Agencies"]
[358,"Mexico",6,"Ministry of Environment and Natural Resources","SEMARNAT",2,"Other Extending Aid Agencies"]
[358,"Mexico",7,"Ministry of Energy","SENER",2,"Other Extending Aid Agencies"]
[358,"Mexico",8,"Ministry of Economy","SECON",2,"Other Extending Aid Agencies"]
[358,"Mexico",9,"Ministry of Agriculture and Rural Development","SEDATU",2,"Other Extending Aid Agencies"]
[358,"Mexico",10,"Ministry of Infrastructure, Communications and Transport","SICT",2,"Other Extending Aid Agencies"]
[358,"Mexico",11,"Ministry of Public Function","SFP",2,"Other Extending Aid Agencies"]
[358,"Mexico",12,"Ministry of Public Education","SEP",2,"Other Extending Aid Agencies"]
[358,"Mexico",13,"Ministry of Health","SSA",2,"Other Extending Aid Agencies"]
[358,"Mexico",14,"Ministry of Labor and Social Welfare","STPS",2,"Other Extending Aid Agencies"]
[358,"Mexico",15,"Ministry of Agrarian, Territorial and Urban Development","SEDATU",2,"Other Extending Aid Agencies"]
[358,"Mexico",16,"National Council for Science and Technology","CONACYT",2,"Other Extending Aid Agencies"]
[358,"Mexico",17,"Ministry of Culture","CULTURA",2,"Other Extending Aid Agencies"]
[358,"Mexico",18,"National Institute for the Development of Indigenous Peoples","INPI",2,"Other Extending Aid Agencies"]
[358,"Mexico",19,"National Electoral Institute","INE",9]
[358,"Mexico",20,"Institute National Institute of Statistics and Geography","INEGI",9]
[358,"Mexico",21,"National Commission of the Retirement Savings System","CONSAR",9]
[358,"Mexico",22,"Mexican Social Security Institute","IMSS",99,"Unknown"]
[358,"Mexico",23,"Institute for Social Security and Services for State Workers","ISSSTE",2,"Other Extending Aid Agencies"]
[358,"Mexico",24,"Federal Institute for Access to Public Information and Data Protection","INAI",9]
[358,"Mexico",25,"Other",null,99,"Unknown"]
[358,"Mexico",99,"Miscellaneous","MISC",99,"Unknown"]
[425,"Argentina",1,"Ministry of Foreign Affairs, International Trade and Worship",null,99,"Unknown"]
[431,"Brazil",1,"Brazilian Cooperation Agency",null,99,"Unknown"]
[431,"Brazil",2,"Ministry of Foreign Affairs",null,99,"Unknown"]
[431,"Brazil",3,"Central Bank",null,99,"Unknown"]
[431,"Brazil",4,"Ministry of Development and Social Assistance, Family and Fight against Hunger",null,99,"Unknown"]
[431,"Brazil",5,"Ministry of Science, Technology and Innovation",null,99,"Unknown"]
[431,"Brazil",6,"National Council for Scientific and Technological Development",null,99,"Unknown"]
[431,"Brazil",7,"National Water and Sanitation Agency",null,99,"Unknown"]
[431,"Brazil",8,"Coordination for the Improvement of Higher Education Personnel",null,99,"Unknown"]
[431,"Brazil",9,"National Institute of Cancer",null,99,"Unknown"]
[431,"Brazil",10,"National School of Public Administration ",null,99,"Unknown"]
[431,"Brazil",11,"Brazilian Agricultural Research Corporation",null,99,"Unknown"]
[431,"Brazil",12,"Ministry of Education","MEC",99,"Unknown"]
[431,"Brazil",13,"Ministry of Health","SAUDE",99,"Unknown"]
[431,"Brazil",14,"Public Universities","Public Universities",99,"Unknown"]
[431,"Brazil",15,"Ministry of Finance","ECONOMIA",99,"Unknown"]
[431,"Brazil",16,"Ministry of Defence","DEFESA",99,"Unknown"]
[431,"Brazil",17,"Ministry of Sport",1,99,"Unknown"]
[431,"Brazil",18,"Ministry of Management and Innovation in Public Service",1,99,"Unknown"]
[431,"Brazil",19,"Ministry of Planning and Budget",1,99,"Unknown"]
[431,"Brazil",20,"Ministry of Development, Industry, Trade and Services",1,99,"Unknown"]
[431,"Brazil",21,"Ministry of Agriculture and Livestock",1,99,"Unknown"]
[431,"Brazil",22,"Ministry of Cities",1,99,"Unknown"]
[431,"Brazil",23,"Ministry of Culture",1,99,"Unknown"]
[431,"Brazil",24,"Ministry of Communications",1,99,"Unknown"]
[431,"Brazil",25,"Ministry of Agrarian Development and Family Agriculture",1,99,"Unknown"]
[431,"Brazil",26,"Ministry of Integration and Regional Development",1,99,"Unknown"]
[431,"Brazil",27,"Ministry of Human Rights and Citizenship",1,99,"Unknown"]
[431,"Brazil",28,"Ministry of Entrepreneurship, Micro-enterprise and Small Business",1,99,"Unknown"]
[431,"Brazil",29,"Ministry of Racial Equality",1,99,"Unknown"]
[431,"Brazil",31,"Ministry of Justice and Public Security",1,99,"Unknown"]
[431,"Brazil",32,"Ministry of the Environment and Climate Change",1,99,"Unknown"]
[431,"Brazil",33,"Ministry of Mines and Energy",1,99,"Unknown"]
[431,"Brazil",34,"Ministry of Women's Affairs",1,99,"Unknown"]
[431,"Brazil",35,"Ministry of Fisheries and Aquaculture",1,99,"Unknown"]
[431,"Brazil",36,"Ministry of Ports and Airports",1,99,"Unknown"]
[431,"Brazil",37,"Ministry of Indigenous Peoples",1,99,"Unknown"]
[431,"Brazil",38,"Ministry of Social Welfare",1,99,"Unknown"]
[431,"Brazil",39,"Ministry of Labor and Employment",1,99,"Unknown"]
[431,"Brazil",40,"Ministry of Transportation",1,99,"Unknown"]
[431,"Brazil",41,"Ministry of Tourism",1,99,"Unknown"]
[431,"Brazil",42,"Comptroller General of the Union",1,99,"Unknown"]
[431,"Brazil",99,"Others","Others",99,"Unknown"]
[434,"Chile",1,"Agencia Chilena para la cooperación internacional al desarrollo",null,1,"Main Aid Agencies (in terms of budget)"]
[437,"Colombia",1,null,null,1,"Main Aid Agencies (in terms of budget)"]
[440,"Ecuador",1,"Ministry of Foreign Affairs and Human Mobility","MREMH",99,"Unknown"]
[440,"Ecuador",2,"Ministry of Agriculture and Livestock","MAG",99,"Unknown"]
[440,"Ecuador",3,"Ministry of Culture and Heritage","MCYP",99,"Unknown"]
[440,"Ecuador",4,"Ministry of Production, International Trade, Investment and Fisheries","MPCEIP",99,"Unknown"]
[440,"Ecuador",5,"Ministry of Economic and Social Inclusion","MIES",99,"Unknown"]
[440,"Ecuador",6,"Ministry of Environment, Water and Ecologic Transition","MAATE",99,"Unknown"]
[440,"Ecuador",7,"National Council for Disabilities' Equality","CONADIS",99,"Unknown"]
[440,"Ecuador",8,"Ministry of Telecomunications and Information Society","MINTEL",99,"Unknown"]
[440,"Ecuador",9,"Department of Higher Education, Science, Technology and Innovation","SENESCYT",99,"Unknown"]
[440,"Ecuador",99,"Other",null,99,"Unknown"]
[454,"Peru",1,"National Civil Service Authority","SERVIR",99,"Unknown"]
[454,"Peru",2,"Public Procurement Office","Peru Compras",99,"Unknown"]
[454,"Peru",3,"National Institute of Statistics and Informatics","INEI",99,"Unknown"]
[454,"Peru",4,"Ministry of Foreign Trade and Tourism","MINCETUR",99,"Unknown"]
[454,"Peru",5,"Ministry of Agricultural Development and Irrigation","MIDAGRI",99,"Unknown"]
[454,"Peru",6,"Ministry of Development and Social Inclusion","MIDIS",99,"Unknown"]
[454,"Peru",7,"Ministry for Women and Vulnerable Population Groups","MIMP",99,"Unknown"]
[454,"Peru",8,"Ministry of Housing, Construction and Sanitation","MVCS",99,"Unknown"]
[454,"Peru",9,"National Prosecution Ministry","MPFN",99,"Unknown"]
[454,"Peru",10,"Public Procurement Regulatory Agency","OSCE",99,"Unknown"]
[454,"Peru",11,"Ministry of Foreign Affairs","RREE",99,"Unknown"]
[454,"Peru",99,"Others",null,99,"Unknown"]
[460,"Uruguay",1,"Uruguayan Agency of International Co-operation","AUCI",1,"Main Aid Agencies (in terms of budget)"]
[460,"Uruguay",2,"Ministry of Environment","MA",2,"Other Extending Aid Agencies"]
[460,"Uruguay",3,"National Institute of Statistics","INE",2,"Other Extending Aid Agencies"]
[460,"Uruguay",99,"Others","Others",99,"Unknown"]
[546,"Israel",1,"Israel MASHAV",null,1,"Main Aid Agencies (in terms of budget)"]
[546,"Israel",2,"Israeli public universities",null,99,"Unknown"]
[546,"Israel",3,"Ministry of Education",null,2,"Other Extending Aid Agencies"]
[546,"Israel",4,"Ministry of Aliyah and Integration",null,2,"Other Extending Aid Agencies"]
[546,"Israel",5,"local government - Municipal authorities",null,3,"Local Governments"]
[546,"Israel",6,"Water Authority",null,2,"Other Extending Aid Agencies"]
[546,"Israel",7,"Ministry of Agriculture",null,2,"Other Extending Aid Agencies"]
[546,"Israel",8,"Ministry of Construction and Housing",null,2,"Other Extending Aid Agencies"]
[546,"Israel",9,"Prime Minister's Office",null,2,"Other Extending Aid Agencies"]
[546,"Israel",10,"Ministry of Economics",null,2,"Other Extending Aid Agencies"]
[546,"Israel",11,"The Office for Regional Cooperation",null,2,"Other Extending Aid Agencies"]
[546,"Israel",12,"Ministry of the Environment",null,2,"Other Extending Aid Agencies"]
[546,"Israel",13,"Ministry of Welfare and Social Services",null,2,"Other Extending Aid Agencies"]
[546,"Israel",14,"Ministry of Health",null,2,"Other Extending Aid Agencies"]
[546,"Israel",15,"Ministry of Foreign Affairs",null,1,"Main Aid Agencies (in terms of budget)"]
[546,"Israel",16,"Ministry of Tourism",null,2,"Other Extending Aid Agencies"]
[546,"Israel",17,"Ministry of Science",null,2,"Other Extending Aid Agencies"]
[546,"Israel",18,"Ministry of Finance",null,2,"Other Extending Aid Agencies"]
[546,"Israel",19,"Ministry of Transportation",null,2,"Other Extending Aid Agencies"]
[546,"Israel",20,"Ministry of Justice",null,2,"Other Extending Aid Agencies"]
[546,"Israel",21,"Ministry of Communication",null,2,"Other Extending Aid Agencies"]
[546,"Israel",22,"Health Funds",null,99,"Unknown"]
[551,"Palestinian Authority",1,"Palestinian International Cooperation Agency","PICA",99,"Unknown"]
[552,"Kuwait",1,"Kuwait Fund for Arab Economic Development (KFAED)","KFAED",99,"Unknown"]
[552,"Kuwait",2,"Government Grants administered by KFAED",null,99,"Unknown"]
[552,"Kuwait",99,"Miscellaneous","MISC",99,"Unknown"]
[561,"Qatar",1,"Qatar Fund for Development","QFFD",1,"Main Aid Agencies (in terms of budget)"]
[561,"Qatar",2,"Doha Institute",null,99,"Unknown"]
[561,"Qatar",3,"Qatar Foundation",null,99,"Unknown"]
[561,"Qatar",4,"Ministry of Foreign Affairs","MOFA",2,"Other Extending Aid Agencies"]
[561,"Qatar",5,"Ministry of Public Health","MOHP",2,"Other Extending Aid Agencies"]
[561,"Qatar",6,"Qatar University",null,99,"Unknown"]
[561,"Qatar",7,"Qatar Airways",null,99,"Unknown"]
[561,"Qatar",8,"Ministry of Defense ",null,2,"Other Extending Aid Agencies"]
[561,"Qatar",99,"Miscellaneous",null,99,"Unknown"]
[566,"Saudi Arabia",1,"King Salman Humanitarian Aid and Relief Center","KSHA",1,"Main Aid Agencies (in terms of budget)"]
[566,"Saudi Arabia",2,"Ministry of Foreign Affairs","MFA",1,"Main Aid Agencies (in terms of budget)"]
[566,"Saudi Arabia",3,"King Abdullah International Foundation for Humanitarian Activities","KAIF",99,"Unknown"]
[566,"Saudi Arabia",4,"Other Governmental Entities","GOV",99,"Unknown"]
[566,"Saudi Arabia",5,"Saudi Campaigns",null,99,"Unknown"]
[566,"Saudi Arabia",6,"Saudi Development Fund","SDF",1,"Main Aid Agencies (in terms of budget)"]
[566,"Saudi Arabia",7,"Ministry of Education","EDUC",2,"Other Extending Aid Agencies"]
[566,"Saudi Arabia",8,"Saudi Red Crescent Authority","SRCA",99,"Unknown"]
[566,"Saudi Arabia",9,"Ministry of Finance","FIN",2,"Other Extending Aid Agencies"]
[566,"Saudi Arabia",10,"Saudi Development and Reconstruction Program for Yemen","SDRPY",99,"Unknown"]
[566,"Saudi Arabia",99,"Miscellaneous","MISC",99,"Unknown"]
[576,"United Arab Emirates",2,"Abu Dhabi Department of Finance","FIN",1,"Main Aid Agencies (in terms of budget)"]
[576,"United Arab Emirates",3,"Abu Dhabi Fund for Development","ADFD",1,"Main Aid Agencies (in terms of budget)"]
[576,"United Arab Emirates",5,"Abu Dhabi Future Energy Co.","MASDAR",1,"Main Aid Agencies (in terms of budget)"]
[576,"United Arab Emirates",7,"International Humanitarian City","IHC",2,"Other Extending Aid Agencies"]
[576,"United Arab Emirates",8,"Mohamed Bin Zayed Species Conservation Fund","MBZ",2,"Other Extending Aid Agencies"]
[576,"United Arab Emirates",9,"Ministry of International Cooperation and Development","MICAD",1,"Main Aid Agencies (in terms of budget)"]
[576,"United Arab Emirates",17,"Khalifa Bin Zayed Al Nahyan Foundation","KBZ",2,"Other Extending Aid Agencies"]
[576,"United Arab Emirates",18,"Mohammed Bin Rashid Al Maktoum Humanitarian and Charity Establishment","MBR",2,"Other Extending Aid Agencies"]
[576,"United Arab Emirates",19,"Zayed Bin Sultan Al Nahyan Charitable and Humanitarian Foundation","ZBS",2,"Other Extending Aid Agencies"]
[576,"United Arab Emirates",20,"Al Maktoum Foundation","MF",2,"Other Extending Aid Agencies"]
[576,"United Arab Emirates",21,"Dubai Cares","DC",2,"Other Extending Aid Agencies"]
[576,"United Arab Emirates",22,"UAE Red Crescent Authority","RCA",1,"Main Aid Agencies (in terms of budget)"]
[576,"United Arab Emirates",23,"Noor Dubai","ND",2,"Other Extending Aid Agencies"]
[576,"United Arab Emirates",25,"Other Government Entities","GOV",2,"Other Extending Aid Agencies"]
[576,"United Arab Emirates",99,"Miscellaneous","MISC",99,"Unknown"]
[611,"Azerbaijan",1,"Government of Azerbaijan","GOV",1,"Main Aid Agencies (in terms of budget)"]
[611,"Azerbaijan",2,"Ministry of Foreign Affairs","MFA",2,"Other Extending Aid Agencies"]
[611,"Azerbaijan",3,"Ministry of Emergency Situations",null,1,"Main Aid Agencies (in terms of budget)"]
[611,"Azerbaijan",4,"MFA/Azerbaijan International Development Agency",null,1,"Main Aid Agencies (in terms of budget)"]
[611,"Azerbaijan",5,"State Customs Committee",null,2,"Other Extending Aid Agencies"]
[611,"Azerbaijan",6,"Ministry of Culture and Tourism",null,2,"Other Extending Aid Agencies"]
[611,"Azerbaijan",7,"Ministry of Youth and Sport",null,2,"Other Extending Aid Agencies"]
[611,"Azerbaijan",8,"Ministry of Health","MoH",2,"Other Extending Aid Agencies"]
[611,"Azerbaijan",9,"Ministry of Ecology and Natural Resources",null,2,"Other Extending Aid Agencies"]
[611,"Azerbaijan",10,"Ministry of Defence",null,2,"Other Extending Aid Agencies"]
[613,"Kazakhstan",1,"Ministry of Foreign Affairs","MFA",1,"Main Aid Agencies (in terms of budget)"]
[613,"Kazakhstan",2,"Government of the Republic of Kazakhstan","GOV",2,"Other Extending Aid Agencies"]
[613,"Kazakhstan",3,"Ministry of Education and Science","EDUC",2,"Other Extending Aid Agencies"]
[613,"Kazakhstan",4,"Sovereign Wealth Fund (Samruk-Kazyna)",null,2,"Other Extending Aid Agencies"]
[613,"Kazakhstan",99,"Miscellaneous","MISC",99,"Unknown"]
[701,"Japan",1,"Ministry of Agriculture, Forestry and Fisheries","MAFF",2,"Other Extending Aid Agencies"]
[701,"Japan",2,"Ministry of Foreign Affairs","MOFA",1,"Main Aid Agencies (in terms of budget)"]
[701,"Japan",4,"EXIM BANK","EXIM BANK",99,"Unknown"]
[701,"Japan",5,"OECF","OECF",99,"Unknown"]
[701,"Japan",6,"FOOD AID","FOOD AID",99,"Unknown"]
[701,"Japan",7,"Overseas Fishery Co-operation Foundation","OFCF",2,"Other Extending Aid Agencies"]
[701,"Japan",8,"Japanese International Co-operation Agency","JICA",1,"Main Aid Agencies (in terms of budget)"]
[701,"Japan",10,"Japan Overseas Development Co-operation","JODC",2,"Other Extending Aid Agencies"]
[701,"Japan",11,"Japan Bank for International Co-operation","JBIC",4,"Export Credit Agencies"]
[701,"Japan",12,"Other Ministries","Oth. MIN",2,"Other Extending Aid Agencies"]
[701,"Japan",13,"Public Corporations","PC",2,"Other Extending Aid Agencies"]
[701,"Japan",14,"Prefectures","PRF",3,"Local Governments"]
[701,"Japan",15,"Ordinance-designed Cities","ODC",3,"Local Governments"]
[701,"Japan",16,"Japan Agency for Medical Research and Development","AMED",9]
[701,"Japan",71,"Nippon Export and Investment Insurance","NEXI",4,"Export Credit Agencies"]
[701,"Japan",99,"Miscellaneous","MISC",2,"Other Extending Aid Agencies"]
[732,"Chinese Taipei",1,"Chinese Taipei",null,1,"Main Aid Agencies (in terms of budget)"]
[738,"Indonesia",1,"Ministry of Foreign Affairs",null,99,"Unknown"]
[738,"Indonesia",2,"Ministry of National Development Planning",null,99,"Unknown"]
[738,"Indonesia",3,"Ministry of Finance",null,99,"Unknown"]
[738,"Indonesia",4,"Ministry of State Secretariat ",null,99,"Unknown"]
[738,"Indonesia",5,"Meteorological, Climatological, and Geophysical Agency",null,99,"Unknown"]
[738,"Indonesia",6,"Ministry for Women Empowerment and Child Protection ",null,99,"Unknown"]
[738,"Indonesia",7,"Ministry of Health",null,99,"Unknown"]
[738,"Indonesia",8,"Ministry of Industry",null,99,"Unknown"]
[738,"Indonesia",9,"Ministry of Agriculture",null,99,"Unknown"]
[738,"Indonesia",10,"Ministry of Communication and Information Technology",null,99,"Unknown"]
[738,"Indonesia",11,"Indonesian National Police",null,99,"Unknown"]
[738,"Indonesia",12,"Ministry of Public Works and Housing",null,99,"Unknown"]
[738,"Indonesia",13,"Infrastructure Planning Center, Regional Infrastructure Development Agency",null,99,"Unknown"]
[738,"Indonesia",14,"Ministry of Maritime Affairs and Fisheries ",null,99,"Unknown"]
[738,"Indonesia",15,"Ministry of Trade ",null,99,"Unknown"]
[738,"Indonesia",16,"Ministry of Education and Culture",null,99,"Unknown"]
[738,"Indonesia",17,"National Agency of Drug and Food Control ",null,99,"Unknown"]
[738,"Indonesia",18,"Ministry of Research and Technology",null,99,"Unknown"]
[738,"Indonesia",19,"Eximbank",null,5,"Development Finance Institutions"]
[738,"Indonesia",20,"Indonesian Agency for International Development","Indonesian AID",99,"Unknown"]
[738,"Indonesia",99,"miscellaneous",null,99,"Unknown"]
[742,"Korea",1,"Ministry of Strategy and Finance","MOSF",1,"Main Aid Agencies (in terms of budget)"]
[742,"Korea",2,"Export-Import Bank of Korea","KEXIM",1,"Main Aid Agencies (in terms of budget)"]
[742,"Korea",3,"Ministry of Foreign Affairs and Trade","MOFAT",1,"Main Aid Agencies (in terms of budget)"]
[742,"Korea",4,"Korea International Cooperation Agency","KOICA",1,"Main Aid Agencies (in terms of budget)"]
[742,"Korea",99,"Miscellaneous","MISC",99,"Unknown"]
[764,"Thailand",1,"Thailand",null,1,"Main Aid Agencies (in terms of budget)"]
[765,"Timor-Leste",1,"Timor Leste",null,1,"Main Aid Agencies (in terms of budget)"]
[801,"Australia",2,"Attorney-General","AG",2,"Other Extending Aid Agencies"]
[801,"Australia",5,"Australian Government","GOV",1,"Main Aid Agencies (in terms of budget)"]
[801,"Australia",72,"Export Finance and Insurance Corporation","EFIC",4,"Export Credit Agencies"]
[801,"Australia",99,"Miscellaneous","MISC",2,"Other Extending Aid Agencies"]
[807,"UNEP",1,"Assessed contributions - UN regular budget","UNEP - Assessed Contributions",99,"Unknown"]
[807,"UNEP",2,"Environment Fund","UNEP - EF",1,"Main Aid Agencies (in terms of budget)"]
[807,"UNEP",3,"Multilateral Fund under the Montreal Protocol on Substances that Deplete the Ozone Layer","UNEP - MFMP",2,"Other Extending Aid Agencies"]
[807,"UNEP",4,"Convention on International Trade in Endangered Species of Wild Fauna and Flora (CITES) - Assessed contributions","CITES POW Assessed Contributions",2,"Other Extending Aid Agencies"]
[807,"UNEP",5,"Convention on International Trade in Endangered Species of Wild Fauna and Flora (CITES) - Voluntary Contributions Non-core - developmental","CITES POW Non-core - developmental",7]
[807,"UNEP",6,"Convention on International Trade in Endangered Species of Wild Fauna and Flora (CITES) - Voluntary Contributions Non-Core - TOSSD only","CITES POW Non-core - TOSSD only",8]
[807,"UNEP",7,"UNEP programme support","UNEP programme support",8]
[807,"UNEP",8,"Other Support to UNEP POW","Other Support - developmental",7]
[807,"UNEP",9,"Other Support to UNEP POW","Other Support - TOSSD-only",8]
[807,"UNEP",10,"Basel, Rotterdam and Stockholm conventions (BRS)- assessed contributions","BRS POW Assessed Contributions",8]
[807,"UNEP",11,"Basel, Rotterdam and Stockholm conventions (BRS) - Voluntary Contributions Non-core - developmental","BRS POW Non-core - developmental",7]
[807,"UNEP",12,"Basel, Rotterdam and Stockholm conventions (BRS) - Voluntary Contributions Non-core TOSSD only","BRS POW Non-core - TOSSD only",8]
[807,"UNEP",13,"Convention on Migratory Species (CMS) - assessed contributions","CMS POW Assessed Contributions",8]
[807,"UNEP",14,"Convention on Migratory Species (CMS) - Voluntary Contributions Non-core developmental","CMS POW Non-core - developmental",7]
[807,"UNEP",15,"Convention on Migratory Species (CMS) - Voluntary Contributions Non-core TOSSD only","CMS POW No-core - TOSSD only",8]
[807,"UNEP",16,"Bamako Convention - Assessed Contribution","Bamako POW Assessed Contributions",7]
[807,"UNEP",17,"Bamako Convention - Voluntary Non-Core Contributions","Bamako POW Non-core",7]
[807,"UNEP",18,"Carpathian Convention - assessed","CAP POW Assessed Contributions",8]
[807,"UNEP",19,"Carpathian Convention - Voluntary Contributions Non-core developmental","CAP POW Non-core - developmental",7]
[807,"UNEP",20,"Carpathian Convention - Voluntary Contributions Non-Core - TOSSD only","CAP POWNon-core - TOSSD oonly",8]
[807,"UNEP",21,"Action Plan for the Caribbean Environment Programme - assessed","CAR RCU POW Assessed Contributions",8]
[807,"UNEP",22,"Action Plan for the Caribbean Environment Programme - Voluntary Contributions Non-core - developmental","CAR RCU POW Non-core - developmental",7]
[807,"UNEP",23,"Action Plan for the Caribbean Environment Programme - Voluntary Contributions Non-Core - TOSSD only","CAR RCU POWNon-core - TOSSD only",8]
[807,"UNEP",24,"Intergovernmental Science-Policy Platform on Biodiversity and Ecosystem Services (IPBES) - Voluntary Contributions Non-core - developmental","IPBES POWNon-core - developmental",7]
[807,"UNEP",25,"Intergovernmental Science-Policy Platform on Biodiversity and Ecosystem Services - (IPBES) Voluntary Contributions Non-core - TOSSD only","IPBES POW Non-core - TOSSD only",8]
[807,"UNEP",26,"Mediterranean Action Plan (MAP) - Assessed contributions - developmental","MAP POW Assessed- developmental",7]
[807,"UNEP",27,"Mediterranean Action Plan (MAP) - Voluntary Contributions Non-core - TOSSD only","MAP POW Assessed - TOSSD only",8]
[807,"UNEP",28,"Mediterranean Action Plan (MAP) - Voluntary Contributions Non-core - developmental","MAP POW Non-core - developmental",7]
[807,"UNEP",29,"Mediterranean Action Plan (MAP) - Voluntary Contributions Non-core - TOSSD only","MAP POWs Non-core - TOSSD only",8]
[807,"UNEP",30,"Minamata Convention on Mercury (MCV) - Assessed Contributions","MCV POW Assessed Contributions",8]
[807,"UNEP",31,"Minamata Convention on Mercury (MCV) - Voluntary Contributions Non-core - developmental","MCV POW Non-core - developmental",7]
[807,"UNEP",32,"Minamata Convention on Mercury (MCV) - Voluntary Contributions Non-core - TOSSD only","MCV POW Non-core - TOSSD only",8]
[807,"UNEP",33,"Northwest Pacific Action Plan (NOWPAP) - Assessed Contributions - developmental","NOWPAP POW Assessed - developmental",7]
[807,"UNEP",34,"Northwest Pacific Action Plan (NOWPAP) - Assessed Contributions - TOSSD only","NOWPAP POW Assessed - TOSSD only",8]
[807,"UNEP",35,"Northwest Pacific Action Plan (NOWPAP) - Voluntary Contributions Non-core - developmental","NOWPAP POW Non-core - developmental",7]
[807,"UNEP",36,"Northwest Pacific Action Plan (NOWPAP) - Voluntary Contributions Non-core - TOSSD only","NOWPAP POW Non-core - TOSSD only",8]
[807,"UNEP",37,"Ozone Treaties (Montreal Protocol and Vienna Convention) - Assessed Contributions - developmental","Ozone POW Assessed - developmental",7]
[807,"UNEP",38,"Ozone Treaties (Montreal Protocol and Vienna Convention) - Assessed Contributions - TOSSD only","Ozone POW Assessed - TOSSD only",8]
[807,"UNEP",39,"Ozone Treaties (Montreal Protocol and Vienna Convention)  - Voluntary Contributions Non-core - developmental","Ozone POW Non-core - developmental",7]
[807,"UNEP",40,"Ozone Treaties (Montreal Protocol and Vienna Convention)  - Voluntary Contributions Non-core - TOSSD only","Ozone POW Non-core - TOSSD only",8]
[807,"UNEP",41,"Convention for the Marine and Coastal Environment of the Atlantic Coast of the West, Central and Southern Africa Region - Assessed Contributions","RSAS POW Assessed Contributions",7]
[807,"UNEP",42,"Convention for the Marine and Coastal Environment of the Atlantic Coast of the West, Central and Southern Africa Region - Non-core","RSAS POW Non-core",7]
[807,"UNEP",43,"Convention on Biological Diversity (CBD) - Assessed Contributions","SCBD POW Assessed Contributions",8]
[807,"UNEP",44,"Convention on Biological Diversity (CBD) - Voluntary Contributions Non-core - developmental","SCBD POW Non-core - developmental",7]
[807,"UNEP",45,"Convention on Biological Diversity (CBD) - Voluntary Contributions Non-core - TOSSD only","SCBD POW Non-core - TOSSD only",8]
[807,"UNEP",46,"UNEP, core and earmarked, developmental",null,7]
[807,"UNEP",47,"UNEP","UNEP",99,"Unknown"]
[811,"Global Environment Facility",1,"GEF (general)","GEF",99,"Unknown"]
[811,"Global Environment Facility",11,"GEF Trust Fund",null,99,"Unknown"]
[811,"Global Environment Facility",12,"Least Developed Countries Trust Fund (LDCF)","LDCF",99,"Unknown"]
[811,"Global Environment Facility",13,"Special Climate Change Trust Fund (SCCF)","SCCF",99,"Unknown"]
[811,"Global Environment Facility",14,"Nagoya Protocol Implementation Fund (NPIF)","NPIF",99,"Unknown"]
[811,"Global Environment Facility",15,"GEF Capacity Building Initiative for Transparency","CBIT",99,"Unknown"]
[811,"Global Environment Facility",16,"GEF Multi-Trust Funds","MTF",99,"Unknown"]
[811,"Global Environment Facility",17,"GEF - regional and global",null,8]
[811,"Global Environment Facility",18,"GEF - earmarked",null,7]
[812,"Montreal Protocol",1,"Montreal Protocol",null,99,"Unknown"]
[820,"New Zealand",1,"Ministry of Foreign Affairs and Trade","NZG",2,"Other Extending Aid Agencies"]
[820,"New Zealand",2,"New Zealand International Aid and Development Agency","NZAid",1,"Main Aid Agencies (in terms of budget)"]
[820,"New Zealand",99,"Miscellaneous","MISC",2,"Other Extending Aid Agencies"]
[901,"World Bank Group",1,"International Bank for Reconstruction and Development",null,99,"Unknown"]
[901,"World Bank Group",2,"Multilateral Investment Guarantee Agency",null,99,"Unknown"]
[901,"World Bank Group",3,"International Finance Corporation",null,1,"Main Aid Agencies (in terms of budget)"]
[901,"World Bank Group",4,"International Development Association",null,99,"Unknown"]
[906,"Caribbean Development Bank",1,"Caribbean Development Bank","CarDB",99,"Unknown"]
[906,"Caribbean Development Bank",2,"EU Sustainable Energy for the Eastern Caribbean Fund",null,7]
[906,"Caribbean Development Bank",3,"UK Sustainable Energy for the Eastern Caribbean Fund",null,7]
[906,"Caribbean Development Bank",4,"United Kingdom Infrastructure Fund",null,7]
[906,"Caribbean Development Bank",5,"Canadian Support to the Energy Sector in the Caribbean Fund",null,7]
[906,"Caribbean Development Bank",6,"EIB Climate Action Line of Credit",null,7]
[906,"Caribbean Development Bank",7,"CDB-administered Deutsche Gesellschaft fuer Internationale Zusammenarbeit",null,7]
[906,"Caribbean Development Bank",8,"Canada - CARICOM Climate Adaptation Fund",null,7]
[906,"Caribbean Development Bank",9,"EU Caribbean Infrastructure Fund",null,7]
[906,"Caribbean Development Bank",10,"Other non-core resources",null,7]
[906,"Caribbean Development Bank",11,"11th European Development Fund Economic Partnership Agreement and CARICOM Single Market and Economy",null,7]
[906,"Caribbean Development Bank",99,"semi-aggregates, non-core ",null,7]
[907,"International Monetary Fund",1,"IMF","IMF",99,"Unknown"]
[909,"Inter-American Development Bank Group",1,"Inter-American Development Bank Group",null,1,"Main Aid Agencies (in terms of budget)"]
[909,"Inter-American Development Bank Group",2,"Fund for Special Operations","FSO",1,"Main Aid Agencies (in terms of budget)"]
[909,"Inter-American Development Bank Group",3,"Fund for Special Operations-Ordinary Capital","FSO-ORC",2,"Other Extending Aid Agencies"]
[909,"Inter-American Development Bank Group",4,"Ordinary Capital","ORC",2,"Other Extending Aid Agencies"]
[909,"Inter-American Development Bank Group",5,"Multilateral Investment Fund","MIF",2,"Other Extending Aid Agencies"]
[909,"Inter-American Development Bank Group",6,"Grant Facility","GRF",2,"Other Extending Aid Agencies"]
[909,"Inter-American Development Bank Group",11,"Clean Technology Fund","CTF",99,"Unknown"]
[909,"Inter-American Development Bank Group",13,"Global Agriculture & Food Security Program Trust Fund","GAF",7]
[909,"Inter-American Development Bank Group",14,"Strategic Climate Fund","SCX",99,"Unknown"]
[909,"Inter-American Development Bank Group",15,"Small Enterprise Development Facility","MSE",2,"Other Extending Aid Agencies"]
[909,"Inter-American Development Bank Group",16,"Small Enterprise Investment Fund","MSF",2,"Other Extending Aid Agencies"]
[909,"Inter-American Development Bank Group",17,"Human Resource Facility","MHR",2,"Other Extending Aid Agencies"]
[909,"Inter-American Development Bank Group",18,"IDB Grant Facility","GRF",2,"Other Extending Aid Agencies"]
[909,"Inter-American Development Bank Group",20,"Fund for Increasing Productivity and Promoting Inclusive Economic Growth","MPF",2,"Other Extending Aid Agencies"]
[909,"Inter-American Development Bank Group",21,"Transparency Trust Fund",null,7]
[909,"Inter-American Development Bank Group",22,"NDC Pipeline Accelerator Multidonor Trust Fund",null,7]
[909,"Inter-American Development Bank Group",23,"Ad Hoc Contributions","ADH",7]
[909,"Inter-American Development Bank Group",24,"Aid for Trade Strategic Thematic Fund","AFT",7]
[909,"Inter-American Development Bank Group",25,"Partnership Trust Fund for Poverty Reduction in Latin America","AUS",7]
[909,"Inter-American Development Bank Group",26,"Brazilian Cofinancing Account",null,7]
[909,"Inter-American Development Bank Group",27,"Canada Cooperation Framework",null,7]
[909,"Inter-American Development Bank Group",28,"Compete Caribbean Partnership Facility ",null,7]
[909,"Inter-American Development Bank Group",29,"Canadian Fund for Universal Legal Identity in Latin America and the Caribbean","CCR",7]
[909,"Inter-American Development Bank Group",30,"Canadian Fund",null,7]
[909,"Inter-American Development Bank Group",31,"China Co-Financing Fund for Latin America and the Caribbean",null,7]
[909,"Inter-American Development Bank Group",32,"Canadian Joint Financing Programs","CJF",7]
[909,"Inter-American Development Bank Group",33,"Cofinancing Special Grants",null,7]
[909,"Inter-American Development Bank Group",34,"Sustainable Colombia Facility",null,7]
[909,"Inter-American Development Bank Group",35,"Canadian Climate Fund for the Private Sector in the Americas","CPS",7]
[909,"Inter-American Development Bank Group",36,"DEFRA Cofinancing Account","DEF",7]
[909,"Inter-American Development Bank Group",37,"Early Childhood Development Innovation Multidonor Fund",null,7]
[909,"Inter-American Development Bank Group",38,"European Commission Amended and Restated Framework Agreement",null,7]
[909,"Inter-American Development Bank Group",39,"European Commission Framework Account",null,7]
[909,"Inter-American Development Bank Group",40,"Sustainable Emerging Cities Multidonor Trust Fund","ESC",7]
[909,"Inter-American Development Bank Group",41,"Readiness Fund of the Forest Carbon Partnership Facility",null,7]
[909,"Inter-American Development Bank Group",42,"Spanish Trust Fund for the Entrepreneurship Program",null,7]
[909,"Inter-American Development Bank Group",43,"Spanish General Cooperation Fund",null,7]
[909,"Inter-American Development Bank Group",44,"Global Infrastructure Facility",null,7]
[909,"Inter-American Development Bank Group",45,"Finnish Technical Assistance Program","FTA",7]
[909,"Inter-American Development Bank Group",46,"Guyana REDD+ Investment Fund","GIF",7]
[909,"Inter-American Development Bank Group",47,"Haiti Reconstruction Fund",null,7]
[909,"Inter-American Development Bank Group",48,"Italian Trust Fund for Regional Competitiveness",null,7]
[909,"Inter-American Development Bank Group",49,"Institutional Capacity Strengthening Thematic Fund",null,7]
[909,"Inter-American Development Bank Group",50,"INTAL","INT",7]
[909,"Inter-American Development Bank Group",51,"Italian Fund for Technical Cooperation Projects",null,7]
[909,"Inter-American Development Bank Group",52,"Italian Trust Fund for the Preparation of MIF Projects","ITM",7]
[909,"Inter-American Development Bank Group",53,"Japanese Consultants Fund","JCF",7]
[909,"Inter-American Development Bank Group",54,"Japan Special Fund Poverty Reduction Program",null,7]
[909,"Inter-American Development Bank Group",55,"Japan Private Public Partnership Financing Account",null,7]
[909,"Inter-American Development Bank Group",56,"Japan Special Fund",null,7]
[909,"Inter-American Development Bank Group",57,"Knowledge Multidonor Economy Fund","KEF",7]
[909,"Inter-American Development Bank Group",58,"Korea Infrastructure Development Co-Financing Facility for Latin America and the Caribbean",null,7]
[909,"Inter-American Development Bank Group",59,"Public Capacity Building Korea Fund for Economic Development",null,7]
[909,"Inter-American Development Bank Group",60,"Knowledge Partnership Korea Fund for Technology and Innovation",null,7]
[909,"Inter-American Development Bank Group",61,"Korea Poverty Reduction Fund",null,7]
[909,"Inter-American Development Bank Group",62,"Korea Private Sector Development and Innovation Fund",null,7]
[909,"Inter-American Development Bank Group",63,"LAIF grant to CC and W&S",null,7]
[909,"Inter-American Development Bank Group",64,"Low Carbon Agriculture for Avoided Deforestation and Poverty Reduction",null,7]
[909,"Inter-American Development Bank Group",65,"Multidonor AquaFund",null,7]
[909,"Inter-American Development Bank Group",66,"AgroLAC 2025 Multidonor Trust Fund",null,7]
[909,"Inter-American Development Bank Group",67,"Multidonor Fund for Biodiversity and Ecosystem Services",null,7]
[909,"Inter-American Development Bank Group",68,"Multidonor Fund for Citizen Security",null,7]
[909,"Inter-American Development Bank Group",69,"Multidonor Disaster Prevention Fund ",null,7]
[909,"Inter-American Development Bank Group",70,"Malaria Elimination Blending Facility",null,7]
[909,"Inter-American Development Bank Group",71,"Multi-Donor Regional Integration Fund",null,7]
[909,"Inter-American Development Bank Group",72,"Gender and Diversity Multidonor Fund",null,7]
[909,"Inter-American Development Bank Group",73,"Mesoamerica Health Facility",null,7]
[909,"Inter-American Development Bank Group",74,"Sustainable Energy and Climate Change Multi-donor Trust Fund",null,7]
[909,"Inter-American Development Bank Group",75,"Portuguese Technical Cooperation Trust Fund",null,7]
[909,"Inter-American Development Bank Group",76,"Regional Fund for Agriculture Technology",null,7]
[909,"Inter-American Development Bank Group",77,"Technical Cooperation and Small Projects Swiss Fund",null,7]
[909,"Inter-American Development Bank Group",78,"Spanish Fund for Water and Sanitation",null,7]
[909,"Inter-American Development Bank Group",79,"United Kingdom Sustainable Infrastructure Program",null,7]
[909,"Inter-American Development Bank Group",80,"Government of Spain - Quincentennial Fund",null,7]
[909,"Inter-American Development Bank Group",81,"Social Progress Trust Fund","SPT",7]
[909,"Inter-American Development Bank Group",82,"Swiss Technical Cooperation Fund for Consulting Services and Training","STC",7]
[909,"Inter-American Development Bank Group",83,"Specialized Financial Intermediary Development Fund","TDF",7]
[909,"Inter-American Development Bank Group",84,"Specialized Financial Intermediary Development Fund","FMM",7]
[909,"Inter-American Development Bank Group",85,"Green Climate Fund","GRN",7]
[909,"Inter-American Development Bank Group",86,"MIF- Clinton Bush Haiti Fund","MCB",7]
[909,"Inter-American Development Bank Group",87,"Nordic Development Fund","NDV",7]
[909,"Inter-American Development Bank Group",88,"Special Climate Change Fund","SCC",7]
[909,"Inter-American Development Bank Group",89,"Amazon Bioeconomy and Forest Management Fund","AMZ",7]
[909,"Inter-American Development Bank Group",90,"UK Blue Carbon Fund","BLU",7]
[909,"Inter-American Development Bank Group",91,"Capacity Building Initiative for Transparency Trust Fund","CBT",7]
[909,"Inter-American Development Bank Group",92,"Global Concessional Financing Facility Trust Fund","CFF",7]
[909,"Inter-American Development Bank Group",93,"Multidonor Trust Fund for the Development of Sustainable Cities in Latin America and the Caribbean","CIT",7]
[909,"Inter-American Development Bank Group",94,"Fostering Fiscal Policy for Climate Change in Latin America and the Caribbean","FFP",7]
[909,"Inter-American Development Bank Group",95,"French Climate Fund for Latin America and the Caribbean","FRC",7]
[909,"Inter-American Development Bank Group",96,"Development Fund for the Ecuador-Colombia Border Integration Zone","ICE",7]
[909,"Inter-American Development Bank Group",97,"Development Fund for the Colombia-Peru Border Integration Zone","ICP",7]
[909,"Inter-American Development Bank Group",98,"Low Carbon Energy Fund for People and Planet","LCE",7]
[909,"Inter-American Development Bank Group",99,"France-IDB Natural Capital Lab Fund","NCL",7]
[909,"Inter-American Development Bank Group",100,"Norwegian Grant for Guyana","NGG",7]
[909,"Inter-American Development Bank Group",101,"Nama Facility Account","NMA",7]
[909,"Inter-American Development Bank Group",102,"Multi-Donor Fund for the Transformation of Technical and Vocational Education and Training","TVT",7]
[909,"Inter-American Development Bank Group",103,"Women Entrepreneurs Finance Initiative (We-Fi)","WEF",7]
[909,"Inter-American Development Bank Group",104,"Pandemic Prevention Response Fund","PPF",7]
[909,"Inter-American Development Bank Group",105,"Framework Readiness Preparatory Support","GRP",7]
[909,"Inter-American Development Bank Group",106,"Global Partnership for Education Fund","GPE",7]
[910,"Central American Bank for Economic Integration",1,"Ordinary capital","ORC",99,"Unknown"]
[910,"Central American Bank for Economic Integration",2,"CABEI - non-core funding ",null,99,"Unknown"]
[913,"African Development Bank Group",1,"AfDB Ordinary Capital","AfDB Ordinary Capital",99,"Unknown"]
[913,"African Development Bank Group",11,"AfDB Middle Income Country Fund",null,99,"Unknown"]
[913,"African Development Bank Group",12,"AfDB Special Relief Fund",null,99,"Unknown"]
[913,"African Development Bank Group",14,"AfDB NEPAD/IPPF",null,99,"Unknown"]
[913,"African Development Bank Group",15,"AfDB African Water Facility Fund",null,99,"Unknown"]
[913,"African Development Bank Group",16,"Fund for African Private Sector Assistance",null,99,"Unknown"]
[913,"African Development Bank Group",20,"Rural Water Supply & Sanitation",null,7]
[913,"African Development Bank Group",21,"Zimbabwe Multi Donor Trust Fund",null,7]
[913,"African Development Bank Group",22,"Africa Digital Financial Inclusion Facility","ADFI",7]
[913,"African Development Bank Group",23,"The Sustainable Energy Fund for Africa","SEFA",7]
[915,"Asian Development Bank Group",1,"Asian Development Bank","AsDB",99,"Unknown"]
[915,"Asian Development Bank Group",2,"Asia Pacific Disaster Response Fund","APDRF",99,"Unknown"]
[915,"Asian Development Bank Group",3,"Climate Change Fund","CCF",99,"Unknown"]
[915,"Asian Development Bank Group",4,"Pakistan Earthquake Fund","PEF",99,"Unknown"]
[915,"Asian Development Bank Group",5,"Japan Special Fund","JSF",99,"Unknown"]
[915,"Asian Development Bank Group",6,"Japan Fund for Prosperous and Resilient Asia and the Pacific",null,99,"Unknown"]
[915,"Asian Development Bank Group",11,"Technical Assistance Special Fund (TASF)","TASF",99,"Unknown"]
[915,"Asian Development Bank Group",12,"Regional Cooperation and Integration Fund (RCIF)","RCIF",99,"Unknown"]
[915,"Asian Development Bank Group",13,"Financial Sector Development Partnership Special Fund","FSDPSF",99,"Unknown"]
[915,"Asian Development Bank Group",14,"Clean Technology Fund","CTF",99,"Unknown"]
[915,"Asian Development Bank Group",15,"Strategic Climate Fund","SCF",99,"Unknown"]
[915,"Asian Development Bank Group",16,"Strategic Climate Fund - Forest Investment Program","SCF-FIP",99,"Unknown"]
[915,"Asian Development Bank Group",17,"Strategic Climate Fund - Scaling Up Renewable Energy in LICs Program","SCF-SURELICP",99,"Unknown"]
[915,"Asian Development Bank Group",19,"ASEAN Infrastructure Fund","AIF",99,"Unknown"]
[915,"Asian Development Bank Group",20,"Canadian Climate Fund For The Private Sector In Asia","CCF-PSA",99,"Unknown"]
[915,"Asian Development Bank Group",21,"Canadian Climate Fund For The Private Sector In Asia II","CCF-PSAII",99,"Unknown"]
[915,"Asian Development Bank Group",22,"Global Environment Facility","GEF",99,"Unknown"]
[915,"Asian Development Bank Group",23,"Green Climate Fund","GCF",99,"Unknown"]
[915,"Asian Development Bank Group",24,"Leading Asia's Private Sector Infrastructure Fund","LAPSIF",99,"Unknown"]
[915,"Asian Development Bank Group",25,"Other non-core resources",null,7]
[915,"Asian Development Bank Group",30,"Afghanistan Infrastructure Trust Fund",null,7]
[915,"Asian Development Bank Group",31,"ASEAN Australia Smart Cities Trust Fund",null,7]
[915,"Asian Development Bank Group",32,"Asia Pacific Project Preparation Facility",null,7]
[915,"Asian Development Bank Group",33,"Asia-Pacific Climate Finance Fund",null,7]
[915,"Asian Development Bank Group",34,"Asian Clean Energy Fund",null,7]
[915,"Asian Development Bank Group",35,"Australian Technical Assistance Grant",null,7]
[915,"Asian Development Bank Group",36,"Carbon Capture and Storage Fund",null,7]
[915,"Asian Development Bank Group",37,"Cities Development Initiative for Asia",null,7]
[915,"Asian Development Bank Group",38,"Clean Energy Fund",null,7]
[915,"Asian Development Bank Group",39,"Cooperation Fund for Project Preparation in the Greater Mekong Subregion and in Other Specific Asian Countries",null,7]
[915,"Asian Development Bank Group",40,"Cooperation Fund in Support of Managing for Development Results",null,7]
[915,"Asian Development Bank Group",41,"Gender and Development Cooperation Fund",null,7]
[915,"Asian Development Bank Group",42,"Governance Cooperation Fund",null,7]
[915,"Asian Development Bank Group",43,"High-Level Technology Fund",null,7]
[915,"Asian Development Bank Group",44,"Integrated Disaster Risk Management Fund",null,7]
[915,"Asian Development Bank Group",45,"Investment Climate Facilitation Fund",null,7]
[915,"Asian Development Bank Group",46,"Ireland Trust Fund for Building Climate Change and Disaster Resilience in Small Island Developing States",null,7]
[915,"Asian Development Bank Group",47,"Japan Fund for Information and Communication Technology",null,7]
[915,"Asian Development Bank Group",48,"Japan Fund for the Joint Crediting Mechanism",null,7]
[915,"Asian Development Bank Group",49,"Multidonor Trust Fund under the Water Financing Partnership Facility",null,7]
[915,"Asian Development Bank Group",50,"People's Republic of China (PRC) Poverty Reduction and Regional Cooperation Fund (formerly PRC Regional Cooperation and Poverty Reduction Fund) ",null,7]
[915,"Asian Development Bank Group",51,"Project Readiness Improvement Trust Fund ",null,7]
[915,"Asian Development Bank Group",52,"Republic of Korea e-Asia and Knowledge Partnership Fund",null,7]
[915,"Asian Development Bank Group",53,"Sanitation Financing Partnership Trust Fund under the Water Financing Partnership Facility",null,7]
[915,"Asian Development Bank Group",54,"Urban Climate Change Resilience Trust Fund",null,7]
[915,"Asian Development Bank Group",55,"Urban Environmental Infrastructure Fund",null,7]
[915,"Asian Development Bank Group",56,"Pakistan Economic Corridors Programme",null,7]
[915,"Asian Development Bank Group",57,"Global Agriculture and Food Security Program",null,7]
[915,"Asian Development Bank Group",58,"Global Partnership for Education Fund",null,7]
[915,"Asian Development Bank Group",59,"United Kingdom Fund for Asia Regional Trade and Connectivity",null,7]
[915,"Asian Development Bank Group",60,"ADB Ventures Investment Fund 1",null,7]
[915,"Asian Development Bank Group",61,"ADB Co-financed Assistance Fund",null,7]
[915,"Asian Development Bank Group",62,"Climate Innovation and Development Fund",null,7]
[918,"EU Institutions",1,"European Commission","EC",1,"Main Aid Agencies (in terms of budget)"]
[918,"EU Institutions",2,"European Development Fund","EDF",1,"Main Aid Agencies (in terms of budget)"]
[918,"EU Institutions",3,"European Investment Bank","EIB",2,"Other Extending Aid Agencies"]
[918,"EU Institutions",4,"Humanitarian Aid Office of the European Commission","ECHO",2,"Other Extending Aid Agencies"]
[918,"EU Institutions",5,"Macro-Financial Assistance","MFA",2,"Other Extending Aid Agencies"]
[918,"EU Institutions",99,"Miscellaneous","MISC",2,"Other Extending Aid Agencies"]
[921,"Arab Fund (AFESD)",1,"Arab Fund ","AFESD",99,"Unknown"]
[923,"UN Peacebuilding Fund",1,"UNPBF","UNPBF",99,"Unknown"]
[926,"Council of Europe",1,"Council of Europe (CoE)","CoE",99,"Unknown"]
[928,"World Health Organisation",1,"WHO","WHO",99,"Unknown"]
[928,"World Health Organisation",2,"WHO Assessed contributions","AC",1,"Main Aid Agencies (in terms of budget)"]
[928,"World Health Organisation",3,"WHO Core Voluntary contributions","CVCA",1,"Main Aid Agencies (in terms of budget)"]
[928,"World Health Organisation",4,"In-kind contributions",null,7]
[928,"World Health Organisation",5,"Voluntary contributions",null,7]
[928,"World Health Organisation",6,"WHO - regional and global (non-developmental)",null,8]
[928,"World Health Organisation",7,"WHO Assessed contributions - regional and global (non-developmental)",null,8]
[928,"World Health Organisation",8,"WHO Core Voluntary contributions - regional and global (non-developmental)",null,8]
[928,"World Health Organisation",9,"In-kind contributions - regional and global (non-developmental)",null,8]
[928,"World Health Organisation",10,"Voluntary contributions - regional and global (non-developmental)",null,8]
[928,"World Health Organisation",11,"WHO Framework Convention on Tobacco Control","FCTC",7]
[928,"World Health Organisation",12,"WHO Framework Convention on Tobacco Control – non-developmental","FCTC – ND",8]
[928,"World Health Organisation",13,"European Observatory of Health Systems","EOHS",8]
[928,"World Health Organisation",14,"Partnership for Maternal, Newborn & Child Health","PMNCH",7]
[928,"World Health Organisation",15,"Alliance for Health Policy and Systems Research","AHPSR",8]
[928,"World Health Organisation",16,"Expanded Special Project for Elimination of Neglected Tropical Disease","ESPEN",7]
[932,"Food and Agriculture Organisation",1,"Core resources - developmental","FAO",99,"Unknown"]
[932,"Food and Agriculture Organisation",2,"Voluntary earmarked contributions – developmental",null,7]
[932,"Food and Agriculture Organisation",3,"Core resources - global and TOSSD-only activities",null,8]
[932,"Food and Agriculture Organisation",4,"Voluntary earmarked contributions - global and TOSSD-only activities",null,8]
[940,"International Labour Organisation",1,"Regular Budget","RB",1,"Main Aid Agencies (in terms of budget)"]
[940,"International Labour Organisation",2,"Regular Budget Technical Cooperation","RBTC",1,"Main Aid Agencies (in terms of budget)"]
[940,"International Labour Organisation",3,"Regular Budget Supplementary Account","RBSA",1,"Main Aid Agencies (in terms of budget)"]
[940,"International Labour Organisation",4,"Voluntary non-core funding - developmental",null,7]
[940,"International Labour Organisation",5,"Regular Budget - regional and global (non-developmental part)",null,8]
[940,"International Labour Organisation",6,"Regular Budget Technical Cooperation - regional and global (non-developmental part)",null,8]
[940,"International Labour Organisation",7,"Voluntary non-core funding – regional and global (non developmental part)",null,8]
[944,"International Atomic Energy Agency",1,"IAEA",null,1,"Main Aid Agencies (in terms of budget)"]
[948,"UNECE",1,"UNECE","UNECE",99,"Unknown"]
[951,"OPEC Fund for International Development",1,"OPEC Fund","OPEC Fund",99,"Unknown"]
[953,"Arab Bank for Economic Development in Africa",1,"Arab Bank for Economic Development in Africa","BADEA",99,"Unknown"]
[958,"IMF (Concessional Trust Funds)",1,"IMF concessional",null,99,"Unknown"]
[959,"UNDP",1,"UNDP","UNDP",99,"Unknown"]
[959,"UNDP",2,"Voluntary non-core funding",null,7]
[959,"UNDP",3,"UNDP- Global and regional activities",null,8]
[962,"United Nations Conference on Trade and Development",1,"Voluntary earmarked resources",null,7]
[962,"United Nations Conference on Trade and Development",2,"United Nations Conference on Trade and Development - Regular budget","UNCTAD",99,"Unknown"]
[963,"UNICEF",1,"UNICEF","UNICEF",1,"Main Aid Agencies (in terms of budget)"]
[963,"UNICEF",2,"Voluntary non-core funding",null,7]
[964,"UNRWA",1,"UNRWA","UNRWA",99,"Unknown"]
[964,"UNRWA",2,"Voluntary non-core funding",null,7]
[966,"WFP",1,"WFP","WFP",99,"Unknown"]
[966,"WFP",2,"Voluntary non-core funding",null,7]
[967,"UNHCR",1,"United Nations High Commissioner for Refugees","UNHCR",99,"Unknown"]
[967,"UNHCR",2,"Voluntary non-core funding",null,7]
[971,"UNAIDS",1,"UNAIDS","UNAIDS",99,"Unknown"]
[971,"UNAIDS",2,"Voluntary non-core funding",null,7]
[971,"UNAIDS",3,"Core resources  - global and TOSSD only",null,8]
[971,"UNAIDS",4,"Voluntary non-core funding - global and TOSSD-only",null,8]
[974,"UNFPA",1,"UNFPA","UNFPA",99,"Unknown"]
[974,"UNFPA",2,"Voluntary non-core funding",null,7]
[974,"UNFPA",3,"Core resources  - global and TOSSD only recipients",null,8]
[974,"UNFPA",4,"Voluntary non-core funding - global and TOSSD-only recipients",null,8]
[976,"Islamic Development Bank",1,"Ordinary Capital Resources","OCR",1,"Main Aid Agencies (in terms of budget)"]
[976,"Islamic Development Bank",2,"Awqaf Properties Investment Fund","APIF",2,"Other Extending Aid Agencies"]
[976,"Islamic Development Bank",3,"Islamic Corporation for the Development of the Private Sector","ICD",2,"Other Extending Aid Agencies"]
[976,"Islamic Development Bank",4,"Islamic solidarity fund for Development","ISFD",2,"Other Extending Aid Agencies"]
[976,"Islamic Development Bank",5,"International Islamic Trade Finance Corporation","ITFC",2,"Other Extending Aid Agencies"]
[976,"Islamic Development Bank",6,"Special Assistance",null,2,"Other Extending Aid Agencies"]
[976,"Islamic Development Bank",7,"IsDB Group Science Technology and Innovation","STI",2,"Other Extending Aid Agencies"]
[976,"Islamic Development Bank",8,"Trust Fund",null,2,"Other Extending Aid Agencies"]
[976,"Islamic Development Bank",9,"WAQF","WAQF",2,"Other Extending Aid Agencies"]
[978,"OSCE",1,"Organisation for Security and Co-operation in Europe","OSCE",1,"Main Aid Agencies (in terms of budget)"]
[981,"Black Sea Trade & Development Bank",1,"BSTDB Ordinary capital","BSTDB",99,"Unknown"]
[988,"IFAD",1,"IFAD","IFAD",99,"Unknown"]
[988,"IFAD",2,"China-IFAD South-South and Triangular Cooperation Facility",null,7]
[988,"IFAD",3,"Enhanced Adaptation for Smallholder Agriculture Programme (ASAP+)","ASAP+",7]
[990,"European Bank for Reconstruction and Development",1,"EBRD","EBRD",99,"Unknown"]
[997,"Global Partnership for Education",1,"FTI","FTI",99,"Unknown"]
[1011,"Climate Investment Funds",10,"Clean Technology Fund","CTF",99,"Unknown"]
[1011,"Climate Investment Funds",20,"Strategic Climate Fund","SCF",99,"Unknown"]
[1011,"Climate Investment Funds",21,"Strategic Climate Fund - FIP","SCF - FIP",99,"Unknown"]
[1011,"Climate Investment Funds",22,"Strategic Climate Fund - PPCR","SCF - PPCR",99,"Unknown"]
[1011,"Climate Investment Funds",23,"Strategic Climate Fund - SREP","SCF - SREP",99,"Unknown"]
[1012,"Adaptation Fund",1,"Adaptation Fund",null,99,"Unknown"]
[1013,"Council of Europe Development Bank",1,"Council of Europe Development Bank (CEB)",null,99,"Unknown"]
[1013,"Council of Europe Development Bank",2,"Migrant and Refugee Fund",null,99,"Unknown"]
[1013,"Council of Europe Development Bank",3,"Social Dividend Account",null,99,"Unknown"]
[1013,"Council of Europe Development Bank",4,"Migrant and Refugee Fund",null,7]
[1013,"Council of Europe Development Bank",5,"Regional Housing Programme",null,7]
[1013,"Council of Europe Development Bank",6,"Regional Housing Programme EU",null,7]
[1013,"Council of Europe Development Bank",7,"Western Balkans Investment Framework",null,7]
[1013,"Council of Europe Development Bank",8,"Italian Fund for Innovative Projects",null,7]
[1013,"Council of Europe Development Bank",9,"Spanish Social Cohesion Account ",null,7]
[1013,"Council of Europe Development Bank",10,"EU Facility for Refugees in Turkey",null,7]
[1013,"Council of Europe Development Bank",11,"Regional Housing Programme USA",null,7]
[1013,"Council of Europe Development Bank",12,"Slovak Inclusive Growth Account",null,7]
[1013,"Council of Europe Development Bank",13,"Eastern Europe Energy Efficiency and Environmental Partnership",null,7]
[1013,"Council of Europe Development Bank",14,"Strengthening Healthcare Infrastructure for All (SHIFA)",null,7]
[1013,"Council of Europe Development Bank",15,"Ukraine Solidarity Fund",null,7]
[1014,"Private Infrastructure Development Group",1,"Infrastructure Crisis Facility – Debt Pool","ICF - DP",1,"Main Aid Agencies (in terms of budget)"]
[1014,"Private Infrastructure Development Group",2,"Emerging Africa Infrastructure Fund","EAIF",1,"Main Aid Agencies (in terms of budget)"]
[1014,"Private Infrastructure Development Group",3,"GuarantCo",null,1,"Main Aid Agencies (in terms of budget)"]
[1014,"Private Infrastructure Development Group",4,"InfraCo Asia",null,1,"Main Aid Agencies (in terms of budget)"]
[1014,"Private Infrastructure Development Group",5,"InfraCo Africa",null,1,"Main Aid Agencies (in terms of budget)"]
[1014,"Private Infrastructure Development Group",6,"GAP",null,1,"Main Aid Agencies (in terms of budget)"]
[1014,"Private Infrastructure Development Group",7,"Technical Assistance Facility","TAF",1,"Main Aid Agencies (in terms of budget)"]
[1015,"Development Bank of Latin America",1,"Development Bank of Latin America","CAF",99,"Unknown"]
[1016,"Green Climate Fund",1,"Green Climate Fund","GCF",99,"Unknown"]
[1016,"Green Climate Fund",2,"Private Sector Facility","GCF",99,"Unknown"]
[1016,"Green Climate Fund",3,"Division of Mitigation and Adaptation","GCF",99,"Unknown"]
[1017,"Credit Guarantee and Investment Facility",1,"Credit Guarantee and Investment Facility","CGIF",99,"Unknown"]
[1018,"Global Energy Efficiency and Renewable Energy Fund",1,"Global Energy Efficiency and Renewable Energy Fund","GEEREF",99,"Unknown"]
[1020,"Central Emergency Response Fund",1,"Rapid Response",null,99,"Unknown"]
[1020,"Central Emergency Response Fund",2,"Under Funded",null,99,"Unknown"]
[1022,"UN inter-agency pooled funds",1,"MPTFO",null,7]
[1022,"UN inter-agency pooled funds",2,"OCHA",null,7]
[1022,"UN inter-agency pooled funds",3,"UNFPA",null,7]
[1022,"UN inter-agency pooled funds",4,"UNICEF",null,7]
[1022,"UN inter-agency pooled funds",5,"UNWOMEN",null,7]
[1022,"UN inter-agency pooled funds",6,"ILO",null,7]
[1022,"UN inter-agency pooled funds",7,"UNOPS",null,7]
[1022,"UN inter-agency pooled funds",8,"WFP",null,7]
[1022,"UN inter-agency pooled funds",9,"FAO",null,7]
[1022,"UN inter-agency pooled funds",10,"IOM",null,7]
[1023,"World Tourism Organisation",1,"UNWTO-Regular Budget","UNWTO-RB",99,"Unknown"]
[1023,"World Tourism Organisation",2,"UNWTO-Extra-Budgetary Project","UNWTO-XBP",7]
[1023,"World Tourism Organisation",3,"UNWTO-Extra-Budgetary Project In-Kind","UNWTO-XBPI",7]
[1023,"World Tourism Organisation",4,"Voluntary non-core funding",null,7]
[1024,"Asian Infrastructure Investment Bank",1,"Asian Infrastructure Investment Bank","AIIB",99,"Unknown"]
[1024,"Asian Infrastructure Investment Bank",2,"Internal Special Funds",null,99,"Unknown"]
[1024,"Asian Infrastructure Investment Bank",3,"External Special Funds",null,7]
[1025,"Center of Excellence in Finance",1,"Center of Excellence in Finance","CEF",99,"Unknown"]
[1026,"SESRIC",1,"SESRIC",null,99,"Unknown"]
[1036,"UN Secretariat",1,"UN Secretariat",null,99,"Unknown"]
[1037,"International Investment Bank",1,"International Investment Bank","IIB",1,"Main Aid Agencies (in terms of budget)"]
[1038,"UN Institute for Disarmament Research",1,"UNIDIR Trust Fund (core resources)","UNIDIR",1,"Main Aid Agencies (in terms of budget)"]
[1038,"UN Institute for Disarmament Research",2,"UNIDIR Trust Fund (non-core resources)",null,7]
[1038,"UN Institute for Disarmament Research",3,"UNIDIR Trust Fund (core resources) - non-developmental",null,8]
[1038,"UN Institute for Disarmament Research",4,"UNIDIR Trust Fund (non-core resources) - non-developmental",null,8]
[1039,"UN Capital Development Fund",1,"Non-core resources",null,7]
[1039,"UN Capital Development Fund",2,"UNCDF","UNCDF",1,"Main Aid Agencies (in terms of budget)"]
[1040,"UN Office on Drugs and Crime",1,"Voluntary non-core funding (developmental)",null,7]
[1040,"UN Office on Drugs and Crime",2,"Voluntary non-core funding (non-developmental)",null,8]
[1040,"UN Office on Drugs and Crime",3,"Regular budget (developmental)",null,1,"Main Aid Agencies (in terms of budget)"]
[1040,"UN Office on Drugs and Crime",4,"Regular budget (TOSSD only)",null,8]
[1041,"Eurasian Fund for Stabilization and Development",1,"Eurasian Fund for Stabilization and Development","EFSD",99,"Unknown"]
[1042,"UN Office of Counter-Terrorism",1,"Voluntary contributions (earmarked funding) – developmental",null,7]
[1042,"UN Office of Counter-Terrorism",2,"Voluntary contributions (earmarked and unearmarked) – non-developmental",null,8]
[1043,"Interpol",1,"Core resources",null,8]
[1043,"Interpol",2,"Non-core resources - developmental",null,7]
[1043,"Interpol",3,"Non-core resources - other",null,8]
[1044,"New Development Bank",1,"New Development Bank","NDB",1,"Main Aid Agencies (in terms of budget)"]
[1044,"New Development Bank",2,"Projection Preparation Fund",null,7]
[1045,"North American Development Bank",1,"North American Development Bank","NADB",1,"Main Aid Agencies (in terms of budget)"]
[1045,"North American Development Bank",2,"Community Assistance Program","CAP",1,"Main Aid Agencies (in terms of budget)"]
[1045,"North American Development Bank",3,"Border Environment Infrastructure Fund","BEIF",7]
[1046,"UN Women",1,"UN Women","UN Women",99,"Unknown"]
[1046,"UN Women",2,"Voluntary non-core",null,7]
[1046,"UN Women",3,"Single-agency thematic funds",null,7]
[1046,"UN Women",4,"Voluntary core – global and TOSSD-only recipients",null,8]
[1046,"UN Women",5,"Voluntary Non-Core – global and TOSSD-only recipients",null,8]
[1046,"UN Women",6,"Single-agency thematic funds - global and TOSSD-only recipients",null,8]
[1047,"COVID-19 Response and Recovery Multi-Partner Trust Fund",1,"COVID-19 Response and Recovery Multi-Partner Trust Fund","UN COVID-1",99,"Unknown"]
[1047,"COVID-19 Response and Recovery Multi-Partner Trust Fund",2,"TOSSD-only recipients",null,8]
[1048,"Joint Sustainable Development Goals Fund",1,"Joint Sustainable Development Goals Fund","Joint SDG ",99,"Unknown"]
[1048,"Joint Sustainable Development Goals Fund",2,"TOSSD-only recipients",null,8]
[1049,"International Commission on Missing Persons",1,"ICMP core resources","ICMP",99,"Unknown"]
[1049,"International Commission on Missing Persons",2,"ICMP Non-core resources",null,7]
[1050,"WHO-Strategic Preparedness and Response Plan",1,"SPRP–Developmental","SPRP",1,"Main Aid Agencies (in terms of budget)"]
[1050,"WHO-Strategic Preparedness and Response Plan",2,"SPRP Developmental, earmarked resources",null,7]
[1050,"WHO-Strategic Preparedness and Response Plan",3,"SPRP - Developmental TOSSD recipients only",null,8]
[1050,"WHO-Strategic Preparedness and Response Plan",4,"SPRP – Global and regional activities",null,8]
[1051,"United Nations Office for Disarmament Affairs",1,"United Nations Office for Disarmament Affairs ",null,99,"Unknown"]
[1052,"International Centre for Genetic Engineering and Biotechnology",1,"ICGEB Core, developmental","ICGEB",1,"Main Aid Agencies (in terms of budget)"]
[1052,"International Centre for Genetic Engineering and Biotechnology",2,"ICGEB Core, global activities",null,8]
[1053,"Asian Forest Cooperation Organisation",1,"AFoCO core resources","AFoCO",99,"Unknown"]
[1053,"Asian Forest Cooperation Organisation",2,"AFoCO non-core resources",null,7]
[1054,"World Organisation for Animal Health",1,"Statutory contribution (General budget) - Developmental",null,1,"Main Aid Agencies (in terms of budget)"]
[1054,"World Organisation for Animal Health",2,"Statutory contribution and voluntary contributions from host country (WOAH Regional Representations) - Developmental",null,1,"Main Aid Agencies (in terms of budget)"]
[1054,"World Organisation for Animal Health",3,"World Animal Health and Welfare Fund (World Fund)",null,7]
[1054,"World Organisation for Animal Health",4,"Statutory contribution (General Budget) – Global",null,8]
[1054,"World Organisation for Animal Health",5,"Statutory contribution and voluntary contribution from WOAH Regional Representations – Global",null,8]
[1055,"CGIAR",1,"CGIAR",null,99,"Unknown"]
[1056,"Organisation of American States",1,"Executive Secretariat for Integral Development","OAS/SEDI",99,"Unknown"]
[1056,"Organisation of American States",2,"Directorate of Human Development Education and Employment","OAS/DHDEE",99,"Unknown"]
[1056,"Organisation of American States",3,"Directorate of Economic Development","OAS/DED",99,"Unknown"]
[1056,"Organisation of American States",4,"Directorate of Sustainable Development","OAS/DSD",99,"Unknown"]
[1056,"Organisation of American States",5,"Inter-American Committee on Ports","CIP",99,"Unknown"]
[1057,"UN Development Coordination Office",1,"UNDCO core resources",null,99,"Unknown"]
[1057,"UN Development Coordination Office",2,"Non-core resources - TOSSD only",null,8]
[1058,"IMF Resilience and Sustainability Trust",1,"IMF Resilience and Sustainability Trust",null,99,"Unknown"]
[1311,"Global Alliance for Vaccines and Immunization",1,"GAVI","GAVI",1,"Main Aid Agencies (in terms of budget)"]
[1311,"Global Alliance for Vaccines and Immunization",2,"International Finance Facility for Immunisation ","IFFIm",1,"Main Aid Agencies (in terms of budget)"]
[1311,"Global Alliance for Vaccines and Immunization",3,"COVAX, non-core",null,7]
[1311,"Global Alliance for Vaccines and Immunization",4,"non-core (other than COVAX)",null,7]
[1312,"Global Fund",1,"Global Fund","Global Fund",99,"Unknown"]
[1313,"Global Green Growth Institute",1,"Green Growth Planning and Implementation","GGPI",99,"Unknown"]
[1313,"Global Green Growth Institute",2,"Investment and Policy Solutions Division","IPSD",99,"Unknown"]
[1313,"Global Green Growth Institute",3,"Thought Leadership","TL",99,"Unknown"]
[1313,"Global Green Growth Institute",4,"Green Investment Services","GIS",99,"Unknown"]
[1313,"Global Green Growth Institute",5,"Green Growth Planning and Implementation",null,7]
[1313,"Global Green Growth Institute",6,"Investment and Policy Solutions Division",null,7]
[1401,"WTO - International Trade Centre",1,"International Trade Centre - Regular budget","ITC",99,"Unknown"]
[1401,"WTO - International Trade Centre",2,"Voluntary non-core funding",null,7]
[1401,"WTO - International Trade Centre",3,"VC unearmarked ",null,99,"Unknown"]
[1401,"WTO - International Trade Centre",4,"Voluntary non-core funding, TOSSD-only activities",null,8]
[1401,"WTO - International Trade Centre",5,"VC unearmarked, TOSSD-only activities",null,8]
[1403,"UN Economic and Social Commission for Western Asia",1,"ESCWA - United Nations Economic and Social Commission for Western Asia","ESCWA",99,"Unknown"]
[1403,"UN Economic and Social Commission for Western Asia",2,"UNESCWA extra-budgetary non-core funding – developmental",null,7]
[1403,"UN Economic and Social Commission for Western Asia",3,"UNESCWA extra-budgetary non-core funding – non-developmental",null,8]
[1404,"World Trade Organisation",1,"WTO - World Trade Organization","WTO",99,"Unknown"]
[1404,"World Trade Organisation",2,"WTO – non-core resources",null,7]
[1404,"World Trade Organisation",3,"WTO – TOSSD only recipient (core and non-core)",null,8]
[1406,"United Nations Industrial Development Organization",1,"UNIDO","UNIDO",99,"Unknown"]
[1406,"United Nations Industrial Development Organization",2,"Extrabudgetary non-core resources",null,7]
[1406,"United Nations Industrial Development Organization",3,"Extrabudgetary non-core resources – global and TOSSD only",null,8]

{"sheet":"Marker","index":10,"n_rows":18,"n_cols":2,"rows_kept":18,"cut":false,"hidden":true,"merged":[[16,1,16,9]]}
["Policy objectives: Gender equality, Aid to environment, PD/GG, Trade development, RMNCH"]
["Rio markers: Biodiversity, Climate change - mitigation, Climate change - adaptation, Desertification"]
[]
[2,"principal objective"]
[1,"significant objective"]
[0,"not targeted"]
[null,"not screened"]
[]
[]
[]
[]
[]
[]
["Flags"]
[]
[1,"significant objective"]
[0,"Negligible or no funding is targeted to RMNCH activities/results. RMNCH is not an objective of the project/programme"]
[null,"not screened"]

{"sheet":"Currency","index":11,"n_rows":78,"n_cols":5,"rows_kept":78,"cut":false,"hidden":true,"merged":[]}
["CurrencyCode","isoCode","CurrencyNameE","CurrencyNameF","Notes"]
[0,null,"DAC indicators","indicateurs CAD","NULL"]
[1,"ATS","Austrian schilling","Schilling autrichien","Replaced by Euro on 1/1/1999"]
[2,"BEF","Belgian franc","Franc belge","Replaced by Euro on 1/1/1999"]
[3,"DKK","Danish krone","Couronne danoise","NULL"]
[4,"FRF","French franc","Franc français","Replaced by Euro on 1/1/1999"]
[5,"DEM","Deutsche mark","Deutsche mark","Replaced by Euro on 1/1/1999"]
[6,"ITL","Italian lira","Lire italienne","Replaced by Euro on 1/1/1999"]
[7,"NLG","Dutch guilder","Florin néerlandais","Replaced by Euro on 1/1/1999"]
[8,"NOK","Norwegian krone","Couronne norvégienne","NULL"]
[9,"PTE","Portuguese escudo","Escudo portugais","Replaced by Euro on 1/1/1999"]
[10,"SEK","Swedish krona","Couronne suedoise","NULL"]
[11,"CHF","Swiss franc","Franc suisse","NULL"]
[12,"GBP","Pound sterling","Livre sterling","NULL"]
[18,"FIM","Finnish markka","Mark finlandais","Replaced by Euro on 1/1/1999"]
[20,"ISK","Icelandic króna","Couronne islandaise","NULL"]
[21,"IEP","Irish pound","Livre irlandaise","Replaced by Euro on 1/1/1999"]
[22,"LUF","Luxembourg franc","Franc luxembourgeois","Replaced by Euro on 1/1/1999"]
[30,"CYP","Cypriot pound","Livre chypriote","Replaced by Euro on 1/1/2008"]
[40,"GRD","Greek drachma","Drachme grecque","Replaced by Euro on 1/1/2001"]
[45,"MLT","Maltese lira","Lire maltaise","Replaced by Euro on 1/1/2008"]
[50,"ESP","Spanish peseta","Peseta espagnole","Replaced by Euro on 1/1/1999"]
[55,"TRY","Turkish lira","Livre turque","NULL"]
[61,"SIT","Slovenian tolar","Tolar slovène","Replaced by Euro on 1/1/2007"]
[62,"HRV","Croatian kuna","Kuna croate","NULL"]
[68,"CZK","Czech koruna","Couronne tchèque","NULL"]
[69,"SKK","Slovak koruna","Couronne slovaque","Replaced by Euro on 1/1/2009"]
[70,"CHF","Swiss franc","Franc suisse","NULL"]
[72,"BGN","Bulgarian lev","Lev bulgare","NULL"]
[75,"HUF","Hungarian forint","Forint hongrois","NULL"]
[76,"PLN","Polish zloty","Zloty polonais","NULL"]
[77,"RON","Romanian leu","Leu roumain","NULL"]
[82,"EEK","Estonian kroon","Couronne estonienne","Replaced by Euro on 1/1/2011"]
[83,"LVL","Latvian lats","Lats letton","Replaced by Euro on 1/1/2014"]
[84,"LTL","Lithuanian litas","Litas lituanien","Replaced by Euro on 1/1/2015"]
[87,"RUB","Russian ruble","Rouble russe","NULL"]
[130,"DZD","Algerian dinar","Dinar algérien","NULL"]
[133,"LYD","Libyan dinar","Dinar libyen","NULL"]
[218,"ZAR","South African rand","Rand sud-africain","NULL"]
[241,"GHS","Ghanaian cedi","Cédi ghanéen","NULL"]
[243,"GNF","Guinean franc","Franc guinéen","NULL"]
[252,"MGA","Malagasy ariary","Ariary malgache","Malagasy franc (ISO-4217:MGF) replaced by Malagasy ariary (ISO-4217:MGA) on 1/1/2005"]
[256,"MRO","Mauritanian ouguiya","Ouguiya mauritanien","NULL"]
[261,"NGN","Naira","Naira","NULL"]
[274,"DJF","Djiboutian franc","Franc djibouti","NULL"]
[301,"CAD","Canadian dollar","Dollar canadien","NULL"]
[302,"USD","United States dollar","Dollar américain","NULL"]
[358,"MXN","Mexican peso","Peso mexicain","(ISO-4217:MXN) ISO-4217 code MXP was replaced after the 1993 revaluation"]
[425,"ARS","Argentine peso","Peso argentin","NULL"]
[431,"BRL","Brazilian real","Réal brésilien","NULL"]
[540,"IRR","Iranian rial ","Rial iranien","NULL"]
[543,"IQD","Iraqi dinar","Dinar irakien","NULL"]
[546,"ILS","Israeli new shekel","Nouveau shekel israélien","(ISO-4217:ILS) The Israeli new shekel has been in use since 1 January 1986"]
[552,"KWD","Kuwaiti dinar","Dinar koweïtien","NULL"]
[558,"OMR","Omani rial","Rial omanais","NULL"]
[561,"QAR","Qatari riyal","Riyal qatarien","NULL"]
[566,"SAR","Saudi riyal","Riyal saoudien","NULL"]
[576,"AED","UAE dirham","Dirham des ÉAU","NULL"]
[611,"AZN","Azerbaijani manat","Manat azerbaïdjanais","NULL"]
[613,"KZT","Kazakhstani tenge","Tenge kazakh","NULL"]
[645,"INR","Indian rupee","Roupie indienne","NULL"]
[701,"JPY","Japanese yen","Yen japonais","NULL"]
[730,"CNY","Chinese yuan","Yuan chinois","NULL"]
[732,"TWD","New Taiwan dollar","Nouveau dollar de Taïwan","NULL"]
[735,"HKD","Hong Kong dollar","Dollar de Hong Kong","NULL"]
[738,"IDR","Indonesian rupiah","Roupie indonésienne","NULL"]
[742,"KRW","South Korean won","Won sud-coréen","NULL"]
[751,"MYR","Malaysian ringgit","Ringgit malaisien","NULL"]
[755,"PHP","Philippine peso","Peso philippin","NULL"]
[761,"SGD","Singapore dollar","Dollar de Singapour","NULL"]
[764,"THB","Thai baht","Baht thaïlandais","NULL"]
[765,"USD","United States dollar","Dollar américain","Timor-Leste (uses USD)"]
[801,"AUD","Australian dollar","Dollar australien","NULL"]
[820,"NZD","New Zealand dollar","Dollar néo-zélandais","NULL"]
[854,"VUV","Vanuatu vatu","Vanuatu vatu","NULL"]
[914,"UA","Unit of Account","Unité de compte","NULL"]
[918,"EUR","Euro","Euro","NULL"]
[943,"XDR","Special Drawing Rights","Droits de tirage spéciaux","NULL"]

{"sheet":"purpose_code","index":12,"n_rows":308,"n_cols":10,"rows_kept":308,"cut":false,"hidden":true,"merged":[]}
["CRS Purposecode","PurposeName_e",null,null,"TOSSD Purposecode","PurposeName_e",null,"P&S",null,"OB 2022 Script"]
[0,"NULL",null,null,11110,"Education policy and administrative management",null,15200]
[11110,"Education policy and administrative management",null,null,11120,"Education facilities and training",null,15210,null,"SELECT --top 10  * "]
[11120,"Education facilities and training",null,null,11130,"Teacher training",null,15220,null,"Purposecode, PurposeName_e"]
[11130,"Teacher training",null,null,11182,"Educational research",null,15230,null,"FROM "]
[11182,"Educational research",null,null,11220,"Primary education",null,15240,null,"DCD_Prod.dcd.LookupPurposecode LP "]
[11220,"Primary education",null,null,11230,"Basic life skills for adults",null,15250,null,"WHERE "]
[11230,"Basic life skills for adults",null,null,11231,"Basic life skills for youth",null,15261,null,"Status in  (1,2,3)"]
[11231,"Basic life skills for youth",null,null,11232,"Primary education equivalent for adults",null,1513010]
[11232,"Primary education equivalent for adults",null,null,11240,"Early childhood education",null,1513020,null,"-- Select  * from DCD_Prod.dcd.LookupPurposeCodeStatus S"]
[11240,"Early childhood education",null,null,11250,"School feeding",null,1513030]
[11250,"School feeding",null,null,11260,"Lower secondary education",null,1516010]
[11260,"Lower secondary education",null,null,11320,"Upper Secondary Education (modified and includes data from 11322)",null,1516020]
[11320,"Upper Secondary Education (modified and includes data from 11322)",null,null,11330,"Vocational training",null,1520010]
[11330,"Vocational training",null,null,11420,"Higher education",null,1520020]
[11420,"Higher education",null,null,11425,"Imputed student costs",null,15113]
[11425,"Imputed student costs",null,null,11430,"Advanced technical and managerial training",null,15130]
[11430,"Advanced technical and managerial training",null,null,12110,"Health policy and administrative management",null,15131]
[12110,"Health policy and administrative management",null,null,12181,"Medical education/training",null,15132]
[12181,"Medical education/training",null,null,12182,"Medical research",null,15134]
[12182,"Medical research",null,null,12191,"Medical services",null,15136]
[12191,"Medical services",null,null,12196,"Health statistics and data",null,15137]
[12196,"Health statistics and data",null,null,12220,"Basic health care",null,15153]
[12220,"Basic health care",null,null,12230,"Basic health infrastructure",null,15160]
[12230,"Basic health infrastructure",null,null,12240,"Basic nutrition",null,15170]
[12240,"Basic nutrition",null,null,12250,"Infectious disease control",null,15180]
[12250,"Infectious disease control",null,null,12261,"Health education",null,15190]
[12261,"Health education",null,null,12262,"Malaria control"]
[12262,"Malaria control",null,null,12263,"Tuberculosis control"]
[12263,"Tuberculosis control",null,null,12264,"COVID-19 control"]
[12264,"COVID-19 control",null,null,12265,"COVID-19 vaccines - excess doses"]
[12265,"COVID-19 vaccines - excess doses",null,null,12266,"COVID-19 vaccines - vaccines specifically purchased"]
[12266,"COVID-19 vaccines - vaccines specifically purchased",null,null,12267,"COVID-19 vaccines – ancillary costs"]
[12267,"COVID-19 vaccines – ancillary costs",null,null,12281,"Health personnel development"]
[12281,"Health personnel development",null,null,12310,"NCDs control, general"]
[12310,"NCDs control, general",null,null,12320,"Tobacco use control"]
[12320,"Tobacco use control",null,null,12330,"Control of harmful use of alcohol and drugs"]
[12330,"Control of harmful use of alcohol and drugs",null,null,12340,"Promotion of mental health and well-being"]
[12340,"Promotion of mental health and well-being",null,null,12350,"Other prevention and treatment of NCDs"]
[12350,"Other prevention and treatment of NCDs",null,null,12382,"Research for prevention and control of NCDs"]
[12382,"Research for prevention and control of NCDs",null,null,13010,"Population policy and administrative management"]
[13010,"Population policy and administrative management",null,null,13020,"Reproductive health care"]
[13020,"Reproductive health care",null,null,13030,"Family planning"]
[13030,"Family planning",null,null,13040,"STD control including HIV/AIDS"]
[13040,"STD control including HIV/AIDS",null,null,13081,"Personnel development for population and reproductive health"]
[13081,"Personnel development for population and reproductive health",null,null,13096,"Population statistics and data"]
[13096,"Population statistics and data",null,null,14010,"Water sector policy and administrative management"]
[14010,"Water sector policy and administrative management",null,null,14015,"Water resources conservation (including data collection)"]
[14015,"Water resources conservation (including data collection)",null,null,14020,"Water supply and sanitation - large systems"]
[14020,"Water supply and sanitation - large systems",null,null,14021,"Water supply - large systems"]
[14021,"Water supply - large systems",null,null,14022,"Sanitation - large systems"]
[14022,"Sanitation - large systems",null,null,14030,"Basic drinking water supply and basic sanitation"]
[14030,"Basic drinking water supply and basic sanitation",null,null,14031,"Basic drinking water supply"]
[14031,"Basic drinking water supply",null,null,14032,"Basic sanitation"]
[14032,"Basic sanitation",null,null,14040,"River basins development"]
[14040,"River basins development",null,null,14050,"Waste management/disposal"]
[14050,"Waste management/disposal",null,null,14081,"Education and training in water supply and sanitation"]
[14081,"Education and training in water supply and sanitation",null,null,15110,"Public sector policy and administrative management"]
[15110,"Public sector policy and administrative management",null,null,15111,"Public finance management (PFM)"]
[15111,"Public finance management (PFM)",null,null,15112,"Decentralisation and support to subnational government"]
[15112,"Decentralisation and support to subnational government",null,null,15113,"Anti-corruption organisations and institutions"]
[15113,"Anti-corruption organisations and institutions",null,null,15114,"Domestic revenue mobilisation"]
[15114,"Domestic revenue mobilisation",null,null,15116,"Tax collection"]
[15116,"Tax collection",null,null,15117,"Budget planning"]
[15117,"Budget planning",null,null,15118,"National audit"]
[15118,"National audit",null,null,15119,"Debt and aid management"]
[15119,"Debt and aid management",null,null,15121,"Foreign affairs"]
[15121,"Foreign affairs",null,null,15122,"Diplomatic missions"]
[15122,"Diplomatic missions",null,null,15123,"Administration of developing countries' foreign aid"]
[15123,"Administration of developing countries' foreign aid",null,null,15124,"General personnel services"]
[15124,"General personnel services",null,null,15125,"Public Procurement"]
[15125,"Public Procurement",null,null,15126,"Other general public services"]
[15126,"Other general public services",null,null,15127,"National monitoring and evaluation"]
[15127,"National monitoring and evaluation",null,null,15128,"Local government finance"]
[15128,"Local government finance",null,null,15129,"Other central transfers to institutions"]
[15129,"Other central transfers to institutions",null,null,15130,"Legal and judicial development"]
[15130,"Legal and judicial development",null,null,15131,"Justice, law and order policy, planning and administration"]
[15131,"Justice, law and order policy, planning and administration",null,null,15132,"Police"]
[15132,"Police",null,null,15133,"Fire and rescue services"]
[15133,"Fire and rescue services",null,null,15134,"Judicial affairs"]
[15134,"Judicial affairs",null,null,15135,"Ombudsman"]
[15135,"Ombudsman",null,null,15136,"Immigration"]
[15136,"Immigration",null,null,15137,"Prisons"]
[15137,"Prisons",null,null,15142,"Macroeconomic policy"]
[15142,"Macroeconomic policy",null,null,15143,"Meteorological services"]
[15143,"Meteorological services",null,null,15144,"National standards development"]
[15144,"National standards development",null,null,15150,"Democratic participation and civil society"]
[15150,"Democratic participation and civil society",null,null,15151,"Elections"]
[15151,"Elections",null,null,15152,"Legislatures and political parties"]
[15152,"Legislatures and political parties",null,null,15153,"Media and free flow of information"]
[15153,"Media and free flow of information",null,null,15154,"Executive office"]
[15154,"Executive office",null,null,15155,"Tax policy and administration support"]
[15155,"Tax policy and administration support",null,null,15156,"Other non-tax revenue mobilisation"]
[15156,"Other non-tax revenue mobilisation",null,null,15160,"Human rights"]
[15160,"Human rights",null,null,15170,"Women's rights organisations and movements, and government institutions"]
[15170,"Women's rights organisations and movements, and government institutions",null,null,15180,"Ending violence against women and girls"]
[15180,"Ending violence against women and girls",null,null,15185,"Local government administration"]
[15185,"Local government administration",null,null,15190,"Facilitation of orderly, safe, regular and responsible migration and mobility"]
[15190,"Facilitation of orderly, safe, regular and responsible migration and mobility",null,null,15196,"Government and civil society statistics and data"]
[15196,"Government and civil society statistics and data",null,null,15210,"Security system management and reform"]
[15210,"Security system management and reform",null,null,15220,"Civilian peace-building, conflict prevention and resolution"]
[15220,"Civilian peace-building, conflict prevention and resolution",null,null,15230,"Participation in international peacekeeping operations"]
[15230,"Participation in international peacekeeping operations",null,null,15240,"Reintegration and SALW control"]
[15240,"Reintegration and SALW control",null,null,15250,"Removal of land mines and explosive remnants of war"]
[15250,"Removal of land mines and explosive remnants of war",null,null,15261,"Child soldiers (prevention and demobilisation)"]
[15261,"Child soldiers (prevention and demobilisation)",null,null,16010,"Social Protection"]
[16010,"Social Protection",null,null,16011,"Social protection and welfare services policy, planning and administration"]
[16011,"Social protection and welfare services policy, planning and administration",null,null,16012,"Social security (excl pensions)"]
[16012,"Social security (excl pensions)",null,null,16013,"General pensions"]
[16013,"General pensions",null,null,16014,"Civil service pensions"]
[16014,"Civil service pensions",null,null,16015,"Social services (incl youth development and women+ children)"]
[16015,"Social services (incl youth development and women+ children)",null,null,16020,"Employment creation"]
[16020,"Employment creation",null,null,16030,"Housing policy and administrative management"]
[16030,"Housing policy and administrative management",null,null,16040,"Low-cost housing"]
[16040,"Low-cost housing",null,null,16050,"Multisector aid for basic social services"]
[16050,"Multisector aid for basic social services",null,null,16061,"Culture and cultural diversity"]
[16061,"Culture and cultural diversity",null,null,16062,"Statistical capacity building"]
[16062,"Statistical capacity building",null,null,16063,"Narcotics control"]
[16063,"Narcotics control",null,null,16064,"Social mitigation of HIV/AIDS"]
[16064,"Social mitigation of HIV/AIDS",null,null,16065,"Recreation and sport"]
[16065,"Recreation and sport",null,null,16066,"Culture"]
[16066,"Culture",null,null,16070,"Labour rights"]
[16070,"Labour rights",null,null,16080,"Social dialogue"]
[16080,"Social dialogue",null,null,21010,"Transport policy and administrative management"]
[21010,"Transport policy and administrative management",null,null,21011,"Transport policy, planning and administration"]
[21011,"Transport policy, planning and administration",null,null,21012,"Public transport services"]
[21012,"Public transport services",null,null,21013,"Transport regulation"]
[21013,"Transport regulation",null,null,21020,"Road transport"]
[21020,"Road transport",null,null,21021,"Feeder road construction"]
[21021,"Feeder road construction",null,null,21022,"Feeder road maintenance"]
[21022,"Feeder road maintenance",null,null,21023,"National road construction"]
[21023,"National road construction",null,null,21024,"National road maintenance"]
[21024,"National road maintenance",null,null,21030,"Rail transport"]
[21030,"Rail transport",null,null,21040,"Water transport"]
[21040,"Water transport",null,null,21050,"Air transport"]
[21050,"Air transport",null,null,21061,"Storage"]
[21061,"Storage",null,null,21081,"Education and training in transport and storage"]
[21081,"Education and training in transport and storage",null,null,22010,"Communications policy and administrative management"]
[22010,"Communications policy and administrative management",null,null,22011,"Communications policy, planning and administration"]
[22011,"Communications policy, planning and administration",null,null,22012,"Postal services"]
[22012,"Postal services",null,null,22013,"Information services"]
[22013,"Information services",null,null,22020,"Telecommunications"]
[22020,"Telecommunications",null,null,22030,"Radio, television, print and online media"]
[22030,"Radio, television, print and online media",null,null,22040,"Information and communication technology (ICT)"]
[22040,"Information and communication technology (ICT)",null,null,22081,"Education and training in ICT, telecommunications and media"]
[22081,"Education and training in ICT, telecommunications and media",null,null,23110,"Energy policy and administrative management"]
[23110,"Energy policy and administrative management",null,null,23111,"Energy sector policy, planning and administration"]
[23111,"Energy sector policy, planning and administration",null,null,23112,"Energy regulation"]
[23112,"Energy regulation",null,null,23181,"Energy education/training"]
[23181,"Energy education/training",null,null,23182,"Energy research"]
[23182,"Energy research",null,null,23183,"Energy conservation and demand-side efficiency"]
[23183,"Energy conservation and demand-side efficiency",null,null,23210,"Energy generation, renewable sources - multiple technologies"]
[23210,"Energy generation, renewable sources - multiple technologies",null,null,23220,"Hydro-electric power plants"]
[23220,"Hydro-electric power plants",null,null,23230,"Solar energy for centralised grids"]
[23230,"Solar energy for centralised grids",null,null,23231,"Solar energy for isolated grids and standalone systems"]
[23231,"Solar energy for isolated grids and standalone systems",null,null,23232,"Solar energy - thermal applications"]
[23232,"Solar energy - thermal applications",null,null,23240,"Wind energy"]
[23240,"Wind energy",null,null,23250,"Marine energy"]
[23250,"Marine energy",null,null,23260,"Geothermal energy"]
[23260,"Geothermal energy",null,null,23270,"Biofuel-fired power plants"]
[23270,"Biofuel-fired power plants",null,null,23310,"Energy generation, non-renewable sources, unspecified"]
[23310,"Energy generation, non-renewable sources, unspecified",null,null,23320,"Coal-fired electric power plants"]
[23320,"Coal-fired electric power plants",null,null,23330,"Oil-fired electric power plants"]
[23330,"Oil-fired electric power plants",null,null,23340,"Natural gas-fired electric power plants"]
[23340,"Natural gas-fired electric power plants",null,null,23350,"Fossil fuel electric power plants with carbon capture and storage (CCS)"]
[23350,"Fossil fuel electric power plants with carbon capture and storage (CCS)",null,null,23360,"Non-renewable waste-fired electric power plants"]
[23360,"Non-renewable waste-fired electric power plants",null,null,23410,"Hybrid energy electric power plants"]
[23410,"Hybrid energy electric power plants",null,null,23510,"Nuclear energy electric power plants and nuclear safety"]
[23510,"Nuclear energy electric power plants and nuclear safety",null,null,23610,"Heat plants"]
[23610,"Heat plants",null,null,23620,"District heating and cooling"]
[23620,"District heating and cooling",null,null,23630,"Electric power transmission and distribution (centralised grids)"]
[23630,"Electric power transmission and distribution (centralised grids)",null,null,23631,"Electric power transmission and distribution (isolated mini-grids)"]
[23631,"Electric power transmission and distribution (isolated mini-grids)",null,null,23640,"Retail gas distribution"]
[23640,"Retail gas distribution",null,null,23641,"Retail distribution of liquid or solid fossil fuels"]
[23641,"Retail distribution of liquid or solid fossil fuels",null,null,23642,"Electric mobility infrastructures"]
[23642,"Electric mobility infrastructures",null,null,24010,"Financial policy and administrative management"]
[24010,"Financial policy and administrative management",null,null,24020,"Monetary institutions"]
[24020,"Monetary institutions",null,null,24030,"Formal sector financial intermediaries"]
[24030,"Formal sector financial intermediaries",null,null,24040,"Informal/semi-formal financial intermediaries"]
[24040,"Informal/semi-formal financial intermediaries",null,null,24050,"Remittance facilitation, promotion and optimisation"]
[24050,"Remittance facilitation, promotion and optimisation",null,null,24081,"Education/training in banking and financial services"]
[24081,"Education/training in banking and financial services",null,null,25010,"Business policy and administration"]
[25010,"Business policy and administration",null,null,25020,"Privatisation"]
[25020,"Privatisation",null,null,25030,"Business development services"]
[25030,"Business development services",null,null,25040,"Responsible business conduct"]
[25040,"Responsible business conduct",null,null,31110,"Agricultural policy and administrative management"]
[31110,"Agricultural policy and administrative management",null,null,31120,"Agricultural development"]
[31120,"Agricultural development",null,null,31130,"Agricultural land resources"]
[31130,"Agricultural land resources",null,null,31140,"Agricultural water resources"]
[31140,"Agricultural water resources",null,null,31150,"Agricultural inputs"]
[31150,"Agricultural inputs",null,null,31161,"Food crop production"]
[31161,"Food crop production",null,null,31162,"Industrial crops/export crops"]
[31162,"Industrial crops/export crops",null,null,31163,"Livestock"]
[31163,"Livestock",null,null,31164,"Agrarian reform"]
[31164,"Agrarian reform",null,null,31165,"Agricultural alternative development"]
[31165,"Agricultural alternative development",null,null,31166,"Agricultural extension"]
[31166,"Agricultural extension",null,null,31181,"Agricultural education/training"]
[31181,"Agricultural education/training",null,null,31182,"Agricultural research"]
[31182,"Agricultural research",null,null,31191,"Agricultural services"]
[31191,"Agricultural services",null,null,31192,"Plant and post-harvest protection and pest control"]
[31192,"Plant and post-harvest protection and pest control",null,null,31193,"Agricultural financial services"]
[31193,"Agricultural financial services",null,null,31194,"Agricultural co-operatives"]
[31194,"Agricultural co-operatives",null,null,31195,"Livestock/veterinary services"]
[31195,"Livestock/veterinary services",null,null,31210,"Forestry policy and administrative management"]
[31210,"Forestry policy and administrative management",null,null,31220,"Forestry development"]
[31220,"Forestry development",null,null,31261,"Fuelwood/charcoal"]
[31261,"Fuelwood/charcoal",null,null,31281,"Forestry education/training"]
[31281,"Forestry education/training",null,null,31282,"Forestry research"]
[31282,"Forestry research",null,null,31291,"Forestry services"]
[31291,"Forestry services",null,null,31310,"Fishing policy and administrative management"]
[31310,"Fishing policy and administrative management",null,null,31320,"Fishery development"]
[31320,"Fishery development",null,null,31381,"Fishery education/training"]
[31381,"Fishery education/training",null,null,31382,"Fishery research"]
[31382,"Fishery research",null,null,31391,"Fishery services"]
[31391,"Fishery services",null,null,32110,"Industrial policy and administrative management"]
[32110,"Industrial policy and administrative management",null,null,32120,"Industrial development"]
[32120,"Industrial development",null,null,32130,"Small and medium-sized enterprises (SME) development"]
[32130,"Small and medium-sized enterprises (SME) development",null,null,32140,"Cottage industries and handicraft"]
[32140,"Cottage industries and handicraft",null,null,32161,"Agro-industries"]
[32161,"Agro-industries",null,null,32162,"Forest industries"]
[32162,"Forest industries",null,null,32163,"Textiles, leather and substitutes"]
[32163,"Textiles, leather and substitutes",null,null,32164,"Chemicals"]
[32164,"Chemicals",null,null,32165,"Fertilizer plants"]
[32165,"Fertilizer plants",null,null,32166,"Cement/lime/plaster"]
[32166,"Cement/lime/plaster",null,null,32167,"Energy manufacturing (fossil fuels)"]
[32167,"Energy manufacturing (fossil fuels)",null,null,32168,"Pharmaceutical production"]
[32168,"Pharmaceutical production",null,null,32169,"Basic metal industries"]
[32169,"Basic metal industries",null,null,32170,"Non-ferrous metal industries"]
[32170,"Non-ferrous metal industries",null,null,32171,"Engineering"]
[32171,"Engineering",null,null,32172,"Transport equipment industry"]
[32172,"Transport equipment industry",null,null,32173,"Modern biofuels manufacturing"]
[32173,"Modern biofuels manufacturing",null,null,32174,"Clean cooking appliances manufacturing"]
[32174,"Clean cooking appliances manufacturing",null,null,32182,"Technological research and development"]
[32182,"Technological research and development",null,null,32210,"Mineral/mining policy and administrative management"]
[32210,"Mineral/mining policy and administrative management",null,null,32220,"Mineral prospection and exploration"]
[32220,"Mineral prospection and exploration",null,null,32261,"Coal"]
[32261,"Coal",null,null,32262,"Oil and gas (upstream)"]
[32262,"Oil and gas (upstream)",null,null,32263,"Ferrous metals"]
[32263,"Ferrous metals",null,null,32264,"Nonferrous metals"]
[32264,"Nonferrous metals",null,null,32265,"Precious metals/materials"]
[32265,"Precious metals/materials",null,null,32266,"Industrial minerals"]
[32266,"Industrial minerals",null,null,32267,"Fertilizer minerals"]
[32267,"Fertilizer minerals",null,null,32268,"Offshore minerals"]
[32268,"Offshore minerals",null,null,32310,"Construction policy and administrative management"]
[32310,"Construction policy and administrative management",null,null,33110,"Trade policy and administrative management"]
[33110,"Trade policy and administrative management",null,null,33120,"Trade facilitation"]
[33120,"Trade facilitation",null,null,33130,"Regional trade agreements (RTAs)"]
[33130,"Regional trade agreements (RTAs)",null,null,33140,"Multilateral trade negotiations"]
[33140,"Multilateral trade negotiations",null,null,33150,"Trade-related adjustment"]
[33150,"Trade-related adjustment",null,null,33181,"Trade education/training"]
[33181,"Trade education/training",null,null,33210,"Tourism policy and administrative management"]
[33210,"Tourism policy and administrative management",null,null,41010,"Environmental policy and administrative management"]
[41010,"Environmental policy and administrative management",null,null,41020,"Biosphere protection"]
[41020,"Biosphere protection",null,null,41030,"Biodiversity"]
[41030,"Biodiversity",null,null,41040,"Site preservation"]
[41040,"Site preservation",null,null,41081,"Environmental education/training"]
[41081,"Environmental education/training",null,null,41082,"Environmental research"]
[41082,"Environmental research",null,null,43010,"Multisector aid"]
[43010,"Multisector aid",null,null,43030,"Urban development and management"]
[43030,"Urban development and management",null,null,43031,"Urban land policy and management"]
[43031,"Urban land policy and management",null,null,43032,"Urban development"]
[43032,"Urban development",null,null,43040,"Rural development"]
[43040,"Rural development",null,null,43041,"Rural land policy and management"]
[43041,"Rural land policy and management",null,null,43042,"Rural development"]
[43042,"Rural development",null,null,43050,"Non-agricultural alternative development"]
[43050,"Non-agricultural alternative development",null,null,43060,"Disaster Risk Reduction"]
[43060,"Disaster Risk Reduction",null,null,43071,"Food security policy and administrative management"]
[43071,"Food security policy and administrative management",null,null,43072,"Household food security programmes"]
[43072,"Household food security programmes",null,null,43073,"Food safety and quality"]
[43073,"Food safety and quality",null,null,43081,"Multisector education/training"]
[43081,"Multisector education/training",null,null,43082,"Research/scientific institutions"]
[43082,"Research/scientific institutions",null,null,51010,"General budget support-related aid"]
[51010,"General budget support-related aid",null,null,52010,"Food assistance"]
[52010,"Food assistance",null,null,53030,"Import support (capital goods)"]
[53030,"Import support (capital goods)",null,null,53040,"Import support (commodities)"]
[53040,"Import support (commodities)",null,null,60010,"Action relating to debt"]
[60010,"Action relating to debt",null,null,60020,"Debt forgiveness"]
[60020,"Debt forgiveness",null,null,60030,"Relief of multilateral debt"]
[60030,"Relief of multilateral debt",null,null,60040,"Rescheduling and refinancing"]
[60040,"Rescheduling and refinancing",null,null,60061,"Debt for development swap"]
[60061,"Debt for development swap",null,null,60062,"Other debt swap"]
[60062,"Other debt swap",null,null,60063,"Debt buy-back"]
[60063,"Debt buy-back",null,null,72010,"Material relief assistance and services "]
[72010,"Material relief assistance and services ",null,null,72011,"Basic Health Care Services in Emergencies"]
[72011,"Basic Health Care Services in Emergencies",null,null,72012,"Education in emergencies"]
[72012,"Education in emergencies",null,null,72040,"Emergency food assistance"]
[72040,"Emergency food assistance",null,null,72050,"Relief co-ordination and support services"]
[72050,"Relief co-ordination and support services",null,null,73010,"Immediate post-emergency reconstruction and rehabilitation"]
[73010,"Immediate post-emergency reconstruction and rehabilitation",null,null,74020,"Multi-hazard response preparedness"]
[74020,"Multi-hazard response preparedness",null,null,91010,"Administrative costs (non-sector allocable)"]
[91010,"Administrative costs (non-sector allocable)",null,null,93010,"Refugees/asylum seekers  in donor countries (non-sector allocable)"]
[93010,"Refugees/asylum seekers  in donor countries (non-sector allocable)",null,null,93011,"Refugees/asylum seekers in donor countries - food and shelter "]
[93011,"Refugees/asylum seekers in donor countries - food and shelter ",null,null,93012,"Refugees/asylum seekers in donor countries - training"]
[93012,"Refugees/asylum seekers in donor countries - training",null,null,93013,"Refugees/asylum seekers in donor countries - health"]
[93013,"Refugees/asylum seekers in donor countries - health",null,null,93014,"Refugees/asylum seekers in donor countries - other temporary sustenance"]
[93014,"Refugees/asylum seekers in donor countries - other temporary sustenance",null,null,93015,"Refugees/asylum seekers in donor countries - voluntary repatriation"]
[93015,"Refugees/asylum seekers in donor countries - voluntary repatriation",null,null,93016,"Refugees/asylum seekers in donor countries - transport"]
[93016,"Refugees/asylum seekers in donor countries - transport",null,null,93017,"Refugees/asylum seekers in donor countries - rescue at sea"]
[93017,"Refugees/asylum seekers in donor countries - rescue at sea",null,null,93018,"Refugees/asylum seekers in donor countries - administrative costs"]
[93018,"Refugees/asylum seekers in donor countries - administrative costs",null,null,99810,"Sectors not specified"]
[99810,"Sectors not specified",null,null,99820,"Promotion of development awareness (non-sector allocable)"]
[99820,"Promotion of development awareness (non-sector allocable)",null,null,1513010,"Fight against transnational organised crime"]
[null,null,null,null,1513020,"Countering violent extremism"]
[null,null,null,null,1513030,"Cyber security"]
[null,null,null,null,1516010,"Transitional justice"]
[null,null,null,null,1516020,"International criminal justice"]
[null,null,null,null,1520010,"Disarmament of Weapons of Mass Destruction (WMD)"]
[null,null,null,null,1520020,"Prevention of Violent Extremism"]

{"sheet":"SDG_focus","index":13,"n_rows":205,"n_cols":2,"rows_kept":205,"cut":false,"hidden":true,"merged":[]}
["target","NameE"]
["0","activity screened but does not aim to contribute directly to any of the SDGs"]
["1","End poverty in all its forms everywhere"]
["1.1","By 2030, eradicate extreme poverty for all people everywhere, currently measured as people living on less than $1.25 a day"]
["1.2","By 2030, reduce at least by half the proportion of men, women and children of all ages living in poverty in all its dimensions according to national definitions"]
["1.3","Implement nationally appropriate social protection systems and measures for all, including floors, and by 2030 achieve substantial coverage of the poor and the vulnerable"]
["1.4","By 2030, ensure that all men and women, in particular the poor and the vulnerable, have equal rights to economic resources, as well as access to basic services, ownership and control over land and other forms of property, inheritance, natural resources, appropriate new technology and financial services, including microfinance"]
["1.5","By 2030, build the resilience of the poor and those in vulnerable situations and reduce their exposure and vulnerability to climate-related extreme events and other economic, social and environmental shocks and disasters"]
["1.a","Ensure significant mobilization of resources from a variety of sources, including through enhanced development cooperation, in order to provide adequate and predictable means for developing countries, in particular least developed countries, to implement programmes and policies to end poverty in all its dimensions"]
["1.b","Create sound policy frameworks at the national, regional and international levels, based on pro-poor and gender-sensitive development strategies, to support accelerated investment in poverty eradication actions"]
["2","End hunger, achieve food security and improved nutrition and promote sustainable agriculture"]
["2.1","By 2030, end hunger and ensure access by all people, in particular the poor and people in vulnerable situations, including infants, to safe, nutritious and sufficient food all year round"]
["2.2","By 2030, end all forms of malnutrition, including achieving, by 2025, the internationally agreed targets on stunting and wasting in children under 5 years of age, and address the nutritional needs of adolescent girls, pregnant and lactating women and older persons"]
["2.3","By 2030, double the agricultural productivity and incomes of small-scale food producers, in particular women, indigenous peoples, family farmers, pastoralists and fishers, including through secure and equal access to land, other productive resources and inputs, knowledge, financial services, markets and opportunities for value addition and non-farm employment"]
["2.4","By 2030, ensure sustainable food production systems and implement resilient agricultural practices that increase productivity and production, that help maintain ecosystems, that strengthen capacity for adaptation to climate change, extreme weather, drought, flooding and other disasters and that progressively improve land and soil quality"]
["2.5","By 2020, maintain the genetic diversity of seeds, cultivated plants and farmed and domesticated animals and their related wild species, including through soundly managed and diversified seed and plant banks at the national, regional and international levels, and promote access to and fair and equitable sharing of benefits arising from the utilization of genetic resources and associated traditional knowledge, as internationally agreed"]
["2.a","Increase investment, including through enhanced international cooperation, in rural infrastructure, agricultural research and extension services, technology development and plant and livestock gene banks in order to enhance agricultural productive capacity in developing countries, in particular least developed countries"]
["2.b","Correct and prevent trade restrictions and distortions in world agricultural markets, including through the parallel elimination of all forms of agricultural export subsidies and all export measures with equivalent effect, in accordance with the mandate of the Doha Development Round"]
["2.c","Adopt measures to ensure the proper functioning of food commodity markets and their derivatives and facilitate timely access to market information, including on food reserves, in order to help limit extreme food price volatility"]
["3","Ensure healthy lives and promote well-being for all at all ages"]
["3.1","By 2030, reduce the global maternal mortality ratio to less than 70 per 100,000 live births"]
["3.2","By 2030, end preventable deaths of newborns and children under 5 years of age, with all countries aiming to reduce neonatal mortality to at least as low as 12 per 1,000 live births and under-5 mortality to at least as low as 25 per 1,000 live births"]
["3.3","By 2030, end the epidemics of AIDS, tuberculosis, malaria and neglected tropical diseases and combat hepatitis, water-borne diseases and other communicable diseases"]
["3.4","By 2030, reduce by one third premature mortality from non-communicable diseases through prevention and treatment and promote mental health and well-being"]
["3.5","Strengthen the prevention and treatment of substance abuse, including narcotic drug abuse and harmful use of alcohol"]
["3.6","By 2020, halve the number of global deaths and injuries from road traffic accidents"]
["3.7","By 2030, ensure universal access to sexual and reproductive health-care services, including for family planning, information and education, and the integration of reproductive health into national strategies and programmes"]
["3.8","Achieve universal health coverage, including financial risk protection, access to quality essential health-care services and access to safe, effective, quality and affordable essential medicines and vaccines for all"]
["3.9","By 2030, substantially reduce the number of deaths and illnesses from hazardous chemicals and air, water and soil pollution and contamination"]
["3.a","Strengthen the implementation of the World Health Organization Framework Convention on Tobacco Control in all countries, as appropriate"]
["3.b","Support the research and development of vaccines and medicines for the communicable and non-communicable diseases that primarily affect developing countries, provide access to affordable essential medicines and vaccines, in accordance with the Doha Declaration on the TRIPS Agreement and Public Health, which affirms the right of developing countries to use to the full the provisions in the Agreement on Trade-Related Aspects of Intellectual Property Rights regarding flexibilities to protect public health, and, in particular, provide access to medicines for all"]
["3.c","Substantially increase health financing and the recruitment, development, training and retention of the health workforce in developing countries, especially in least developed countries and small island developing States"]
["3.d","Strengthen the capacity of all countries, in particular developing countries, for early warning, risk reduction and management of national and global health risks"]
["4","Ensure inclusive and equitable quality education and promote lifelong learning opportunities for all"]
["4.1","By 2030, ensure that all girls and boys complete free, equitable and quality primary and secondary education leading to relevant and effective learning outcomes"]
["4.2","By 2030, ensure that all girls and boys have access to quality early childhood development, care and pre-primary education so that they are ready for primary education"]
["4.3","By 2030, ensure equal access for all women and men to affordable and quality technical, vocational and tertiary education, including university"]
["4.4","By 2030, substantially increase the number of youth and adults who have relevant skills, including technical and vocational skills, for employment, decent jobs and entrepreneurship"]
["4.5","By 2030, eliminate gender disparities in education and ensure equal access to all levels of education and vocational training for the vulnerable, including persons with disabilities, indigenous peoples and children in vulnerable situations"]
["4.6","By 2030, ensure that all youth and a substantial proportion of adults, both men and women, achieve literacy and numeracy"]
["4.7","By 2030, ensure that all learners acquire the knowledge and skills needed to promote sustainable development, including, among others, through education for sustainable development and sustainable lifestyles, human rights, gender equality, promotion of a culture of peace and non-violence, global citizenship and appreciation of cultural diversity and of culture’s contribution to sustainable development"]
["4.a","Build and upgrade education facilities that are child, disability and gender sensitive and provide safe, non-violent, inclusive and effective learning environments for all"]
["4.b","By 2020, substantially expand globally the number of scholarships available to developing countries, in particular least developed countries, small island developing States and African countries, for enrolment in higher education, including vocational training and information and communications technology, technical, engineering and scientific programmes, in developed countries and other developing countries"]
["4.c","By 2030, substantially increase the supply of qualified teachers, including through international cooperation for teacher training in developing countries, especially least developed countries and small island developing States"]
["5","Achieve gender equality and empower all women and girls"]
["5.1","End all forms of discrimination against all women and girls everywhere"]
["5.2","Eliminate all forms of violence against all women and girls in the public and private spheres, including trafficking and sexual and other types of exploitation"]
["5.3","Eliminate all harmful practices, such as child, early and forced marriage and female genital mutilation"]
["5.4","Recognize and value unpaid care and domestic work through the provision of public services, infrastructure and social protection policies and the promotion of shared responsibility within the household and the family as nationally appropriate"]
["5.5","Ensure women’s full and effective participation and equal opportunities for leadership at all levels of decision-making in political, economic and public life"]
["5.6","Ensure universal access to sexual and reproductive health and reproductive rights as agreed in accordance with the Programme of Action of the International Conference on Population and Development and the Beijing Platform for Action and the outcome documents of their review conferences"]
["5.a","Undertake reforms to give women equal rights to economic resources, as well as access to ownership and control over land and other forms of property, financial services, inheritance and natural resources, in accordance with national laws"]
["5.b","Enhance the use of enabling technology, in particular information and communications technology, to promote the empowerment of women"]
["5.c","Adopt and strengthen sound policies and enforceable legislation for the promotion of gender equality and the empowerment of all women and girls at all levels"]
["6","Ensure availability and sustainable management of water and sanitation for all"]
["6.1","By 2030, achieve universal and equitable access to safe and affordable drinking water for all"]
["6.2","By 2030, achieve access to adequate and equitable sanitation and hygiene for all and end open defecation, paying special attention to the needs of women and girls and those in vulnerable situations"]
["6.3","By 2030, improve water quality by reducing pollution, eliminating dumping and minimizing release of hazardous chemicals and materials, halving the proportion of untreated wastewater and substantially increasing recycling and safe reuse globally"]
["6.4","By 2030, substantially increase water-use efficiency across all sectors and ensure sustainable withdrawals and supply of freshwater to address water scarcity and substantially reduce the number of people suffering from water scarcity"]
["6.5","By 2030, implement integrated water resources management at all levels, including through transboundary cooperation as appropriate"]
["6.6","By 2020, protect and restore water-related ecosystems, including mountains, forests, wetlands, rivers, aquifers and lakes"]
["6.a","By 2030, expand international cooperation and capacity-building support to developing countries in water- and sanitation-related activities and programmes, including water harvesting, desalination, water efficiency, wastewater treatment, recycling and reuse technologies"]
["6.b","Support and strengthen the participation of local communities in improving water and sanitation management"]
["7","Ensure access to affordable, reliable, sustainable and modern energy for all"]
["7.1","By 2030, ensure universal access to affordable, reliable and modern energy services"]
["7.2","By 2030, increase substantially the share of renewable energy in the global energy mix"]
["7.3","By 2030, double the global rate of improvement in energy efficiency"]
["7.a","By 2030, enhance international cooperation to facilitate access to clean energy research and technology, including renewable energy, energy efficiency and advanced and cleaner fossil-fuel technology, and promote investment in energy infrastructure and clean energy technology"]
["7.b","By 2030, expand infrastructure and upgrade technology for supplying modern and sustainable energy services for all in developing countries, in particular least developed countries, small island developing States and landlocked developing countries, in accordance with their respective programmes of support"]
["8","Promote sustained, inclusive and sustainable economic growth, full and productive employment and decent work for all"]
["8.1","Sustain per capita economic growth in accordance with national circumstances and, in particular, at least 7 per cent gross domestic product growth per annum in the least developed countries"]
["8.2","Achieve higher levels of economic productivity through diversification, technological upgrading and innovation, including through a focus on high-value added and labour-intensive sectors"]
["8.3","Promote development-oriented policies that support productive activities, decent job creation, entrepreneurship, creativity and innovation, and encourage the formalization and growth of micro-, small- and medium-sized enterprises, including through access to financial services"]
["8.4","Improve progressively, through 2030, global resource efficiency in consumption and production and endeavour to decouple economic growth from environmental degradation, in accordance with the 10-Year Framework of Programmes on Sustainable Consumption and Production, with developed countries taking the lead"]
["8.5","By 2030, achieve full and productive employment and decent work for all women and men, including for young people and persons with disabilities, and equal pay for work of equal value"]
["8.6","By 2020, substantially reduce the proportion of youth not in employment, education or training"]
["8.7","Take immediate and effective measures to eradicate forced labour, end modern slavery and human trafficking and secure the prohibition and elimination of the worst forms of child labour, including recruitment and use of child soldiers, and by 2025 end child labour in all its forms "]
["8.8","Protect labour rights and promote safe and secure working environments for all workers, including migrant workers, in particular women migrants, and those in precarious employment"]
["8.9","By 2030, devise and implement policies to promote sustainable tourism that creates jobs and promotes local culture and products"]
["8.10","Strengthen the capacity of domestic financial institutions to encourage and expand access to banking, insurance and financial services for all"]
["8.a","Increase Aid for Trade support for developing countries, in particular least developed countries, including through the Enhanced Integrated Framework for Trade-related Technical Assistance to Least Developed Countries"]
["8.b","By 2020, develop and operationalize a global strategy for youth employment and implement the Global Jobs Pact of the International Labour Organization"]
["9","Build resilient infrastructure, promote inclusive and sustainable industrialization and foster innovation"]
["9.1","Develop quality, reliable, sustainable and resilient infrastructure, including regional and transborder infrastructure, to support economic development and human well-being, with a focus on affordable and equitable access for all"]
["9.2","Promote inclusive and sustainable industrialization and, by 2030, significantly raise industry’s share of employment and gross domestic product, in line with national circumstances, and double its share in least developed countries"]
["9.3","Increase the access of small-scale industrial and other enterprises, in particular in developing countries, to financial services, including affordable credit, and their integration into value chains and markets"]
["9.4","By 2030, upgrade infrastructure and retrofit industries to make them sustainable, with increased resource-use efficiency and greater adoption of clean and environmentally sound technologies and industrial processes, with all countries taking action in accordance with their respective capabilities"]
["9.5","Enhance scientific research, upgrade the technological capabilities of industrial sectors in all countries, in particular developing countries, including, by 2030, encouraging innovation and substantially increasing the number of research and development workers per 1 million people and public and private research and development spending"]
["9.a","Facilitate sustainable and resilient infrastructure development in developing countries through enhanced financial, technological and technical support to African countries, least developed countries, landlocked developing countries and small island developing States"]
["9.b","Support domestic technology development, research and innovation in developing countries, including by ensuring a conducive policy environment for, inter alia, industrial diversification and value addition to commodities"]
["9.c","Significantly increase access to information and communications technology and strive to provide universal and affordable access to the Internet in least developed countries by 2020"]
["10","Reduce inequality within and among countries"]
["10.1","By 2030, progressively achieve and sustain income growth of the bottom 40 per cent of the population at a rate higher than the national average"]
["10.2","By 2030, empower and promote the social, economic and political inclusion of all, irrespective of age, sex, disability, race, ethnicity, origin, religion or economic or other status"]
["10.3","Ensure equal opportunity and reduce inequalities of outcome, including by eliminating discriminatory laws, policies and practices and promoting appropriate legislation, policies and action in this regard"]
["10.4","Adopt policies, especially fiscal, wage and social protection policies, and progressively achieve greater equality"]
["10.5","Improve the regulation and monitoring of global financial markets and institutions and strengthen the implementation of such regulations"]
["10.6","Ensure enhanced representation and voice for developing countries in decision-making in global international economic and financial institutions in order to deliver more effective, credible, accountable and legitimate institutions"]
["10.7","Facilitate orderly, safe, regular and responsible migration and mobility of people, including through the implementation of planned and well-managed migration policies"]
["10.a","Implement the principle of special and differential treatment for developing countries, in particular least developed countries, in accordance with World Trade Organization agreements"]
["10.b","Encourage official development assistance and financial flows, including foreign direct investment, to States where the need is greatest, in particular least developed countries, African countries, small island developing States and landlocked developing countries, in accordance with their national plans and programmes"]
["10.c","By 2030, reduce to less than 3 per cent the transaction costs of migrant remittances and eliminate remittance corridors with costs higher than 5 per cent"]
["11","Make cities and human settlements inclusive, safe, resilient and sustainable"]
["11.1","By 2030, ensure access for all to adequate, safe and affordable housing and basic services and upgrade slums"]
["11.2","By 2030, provide access to safe, affordable, accessible and sustainable transport systems for all, improving road safety, notably by expanding public transport, with special attention to the needs of those in vulnerable situations, women, children, persons with disabilities and older persons"]
["11.3","By 2030, enhance inclusive and sustainable urbanization and capacity for participatory, integrated and sustainable human settlement planning and management in all countries"]
["11.4","Strengthen efforts to protect and safeguard the world’s cultural and natural heritage"]
["11.5","By 2030, significantly reduce the number of deaths and the number of people affected and substantially decrease the direct economic losses relative to global gross domestic product caused by disasters, including water-related disasters, with a focus on protecting the poor and people in vulnerable situations"]
["11.6","By 2030, reduce the adverse per capita environmental impact of cities, including by paying special attention to air quality and municipal and other waste management"]
["11.7","By 2030, provide universal access to safe, inclusive and accessible, green and public spaces, in particular for women and children, older persons and persons with disabilities"]
["11.a","Support positive economic, social and environmental links between urban, peri-urban and rural areas by strengthening national and regional development planning"]
["11.b","By 2020, substantially increase the number of cities and human settlements adopting and implementing integrated policies and plans towards inclusion, resource efficiency, mitigation and adaptation to climate change, resilience to disasters, and develop and implement, in line with the Sendai Framework for Disaster Risk Reduction 2015–2030, holistic disaster risk management at all levels"]
["11.c","Support least developed countries, including through financial and technical assistance, in building sustainable and resilient buildings utilizing local materials"]
["12","Ensure sustainable consumption and production patterns"]
["12.1","Implement the 10-Year Framework of Programmes on Sustainable Consumption and Production Patterns, all countries taking action, with developed countries taking the lead, taking into account the development and capabilities of developing countries"]
["12.2","By 2030, achieve the sustainable management and efficient use of natural resources"]
["12.3","By 2030, halve per capita global food waste at the retail and consumer levels and reduce food losses along production and supply chains, including post-harvest losses"]
["12.4","By 2020, achieve the environmentally sound management of chemicals and all wastes throughout their life cycle, in accordance with agreed international frameworks, and significantly reduce their release to air, water and soil in order to minimize their adverse impacts on human health and the environment"]
["12.5","By 2030, substantially reduce waste generation through prevention, reduction, recycling and reuse"]
["12.6","Encourage companies, especially large and transnational companies, to adopt sustainable practices and to integrate sustainability information into their reporting cycle"]
["12.7","Promote public procurement practices that are sustainable, in accordance with national policies and priorities"]
["12.8","By 2030, ensure that people everywhere have the relevant information and awareness for sustainable development and lifestyles in harmony with nature"]
["12.a","Support developing countries to strengthen their scientific and technological capacity to move towards more sustainable patterns of consumption and production"]
["12.b","Develop and implement tools to monitor sustainable development impacts for sustainable tourism that creates jobs and promotes local culture and products"]
["12.c","Rationalize inefficient fossil-fuel subsidies that encourage wasteful consumption by removing market distortions, in accordance with national circumstances, including by restructuring taxation and phasing out those harmful subsidies, where they exist, to reflect their environmental impacts, taking fully into account the specific needs and conditions of developing countries and minimizing the possible adverse impacts on their development in a manner that protects the poor and the affected communities"]
["13","Take urgent action to combat climate change and its impacts"]
["13.1","Strengthen resilience and adaptive capacity to climate-related hazards and natural disasters in all countries"]
["13.2","Integrate climate change measures into national policies, strategies and planning"]
["13.3","Improve education, awareness-raising and human and institutional capacity on climate change mitigation, adaptation, impact reduction and early warning"]
["13.a","Implement the commitment undertaken by developed-country parties to the United Nations Framework Convention on Climate Change to a goal of mobilizing jointly $100 billion annually by 2020 from all sources to address the needs of developing countries in the context of meaningful mitigation actions and transparency on implementation and fully operationalize the Green Climate Fund through its capitalization as soon as possible"]
["13.b","Promote mechanisms for raising capacity for effective climate change-related planning and management in least developed countries and small island developing States, including focusing on women, youth and local and marginalized communities"]
["14","Conserve and sustainably use the oceans, seas and marine resources for sustainable development"]
["14.1","By 2025, prevent and significantly reduce marine pollution of all kinds, in particular from land-based activities, including marine debris and nutrient pollution"]
["14.2","By 2020, sustainably manage and protect marine and coastal ecosystems to avoid significant adverse impacts, including by strengthening their resilience, and take action for their restoration in order to achieve healthy and productive oceans"]
["14.3","Minimize and address the impacts of ocean acidification, including through enhanced scientific cooperation at all levels"]
["14.4","By 2020, effectively regulate harvesting and end overfishing, illegal, unreported and unregulated fishing and destructive fishing practices and implement science-based management plans, in order to restore fish stocks in the shortest time feasible, at least to levels that can produce maximum sustainable yield as determined by their biological characteristics"]
["14.5","By 2020, conserve at least 10 per cent of coastal and marine areas, consistent with national and international law and based on the best available scientific information"]
["14.6","By 2020, prohibit certain forms of fisheries subsidies which contribute to overcapacity and overfishing, eliminate subsidies that contribute to illegal, unreported and unregulated fishing and refrain from introducing new such subsidies, recognizing that appropriate and effective special and differential treatment for developing and least developed countries should be an integral part of the World Trade Organization fisheries subsidies negotiation3"]
["14.7","By 2030, increase the economic benefits to small island developing States and least developed countries from the sustainable use of marine resources, including through sustainable management of fisheries, aquaculture and tourism"]
["14.a","Increase scientific knowledge, develop research capacity and transfer marine technology, taking into account the Intergovernmental Oceanographic Commission Criteria and Guidelines on the Transfer of Marine Technology, in order to improve ocean health and to enhance the contribution of marine biodiversity to the development of developing countries, in particular small island developing States and least developed countries"]
["14.b","Provide access for small-scale artisanal fishers to marine resources and markets"]
["14.c","Enhance the conservation and sustainable use of oceans and their resources by implementing international law as reflected in the United Nations Convention on the Law of the Sea, which provides the legal framework for the conservation and sustainable use of oceans and their resources, as recalled in paragraph 158 of “The future we want”"]
["15","Protect, restore and promote sustainable use of terrestrial ecosystems, sustainably manage forests, combat desertification, and halt and reverse land degradation and halt biodiversity loss"]
["15.1","By 2020, ensure the conservation, restoration and sustainable use of terrestrial and inland freshwater ecosystems and their services, in particular forests, wetlands, mountains and drylands, in line with obligations under international agreements"]
["15.2","By 2020, promote the implementation of sustainable management of all types of forests, halt deforestation, restore degraded forests and substantially increase afforestation and reforestation globally"]
["15.3","By 2030, combat desertification, restore degraded land and soil, including land affected by desertification, drought and floods, and strive to achieve a land degradation-neutral world"]
["15.4","By 2030, ensure the conservation of mountain ecosystems, including their biodiversity, in order to enhance their capacity to provide benefits that are essential for sustainable development"]
["15.5","Take urgent and significant action to reduce the degradation of natural habitats, halt the loss of biodiversity and, by 2020, protect and prevent the extinction of threatened species"]
["15.6","Promote fair and equitable sharing of the benefits arising from the utilization of genetic resources and promote appropriate access to such resources, as internationally agreed"]
["15.7","Take urgent action to end poaching and trafficking of protected species of flora and fauna and address both demand and supply of illegal wildlife products"]
["15.8","By 2020, introduce measures to prevent the introduction and significantly reduce the impact of invasive alien species on land and water ecosystems and control or eradicate the priority species"]
["15.9","By 2020, integrate ecosystem and biodiversity values into national and local planning, development processes, poverty reduction strategies and accounts"]
["15.a","Mobilize and significantly increase financial resources from all sources to conserve and sustainably use biodiversity and ecosystems"]
["15.b","Mobilize significant resources from all sources and at all levels to finance sustainable forest management and provide adequate incentives to developing countries to advance such management, including for conservation and reforestation"]
["15.c","Enhance global support for efforts to combat poaching and trafficking of protected species, including by increasing the capacity of local communities to pursue sustainable livelihood opportunities"]
["16","Promote peaceful and inclusive societies for sustainable development, provide access to justice for all and build effective, accountable and inclusive institutions at all levels"]
["16.1","Significantly reduce all forms of violence and related death rates everywhere"]
["16.2","End abuse, exploitation, trafficking and all forms of violence against and torture of children"]
["16.3","Promote the rule of law at the national and international levels and ensure equal access to justice for all"]
["16.4","By 2030, significantly reduce illicit financial and arms flows, strengthen the recovery and return of stolen assets and combat all forms of organized crime"]
["16.5","Substantially reduce corruption and bribery in all their forms"]
["16.6","Develop effective, accountable and transparent institutions at all levels"]
["16.7","Ensure responsive, inclusive, participatory and representative decision-making at all levels"]
["16.8","Broaden and strengthen the participation of developing countries in the institutions of global governance"]
["16.9","By 2030, provide legal identity for all, including birth registration"]
["16.10","Ensure public access to information and protect fundamental freedoms, in accordance with national legislation and international agreements"]
["16.a","Strengthen relevant national institutions, including through international cooperation, for building capacity at all levels, in particular in developing countries, to prevent violence and combat terrorism and crime"]
["16.b","Promote and enforce non-discriminatory laws and policies for sustainable development"]
["17","Strengthen the means of implementation and revitalize the global partnership for sustainable development"]
["17.1","Strengthen domestic resource mobilization, including through international support to developing countries, to improve domestic capacity for tax and other revenue collection"]
["17.2","Developed countries to implement fully their official development assistance commitments, including the commitment by many developed countries to achieve the target of 0.7 per cent of gross national income for official development assistance (ODA/GNI) to developing countries and 0.15 to 0.20 per cent of ODA/GNI to least developed countries; ODA providers are encouraged to consider setting a target to provide at least 0.20 per cent of ODA/GNI to least developed countries"]
["17.3","Mobilize additional financial resources for developing countries from multiple sources"]
["17.4","Assist developing countries in attaining long-term debt sustainability through coordinated policies aimed at fostering debt financing, debt relief and debt restructuring, as appropriate, and address the external debt of highly indebted poor countries to reduce debt distress"]
["17.5","Adopt and implement investment promotion regimes for least developed countries"]
["17.6","Enhance North-South, South-South and triangular regional and international cooperation on and access to science, technology and innovation and enhance knowledge-sharing on mutually agreed terms, including through improved coordination among existing mechanisms, in particular at the United Nations level, and through a global technology facilitation mechanism"]
["17.7","Promote the development, transfer, dissemination and diffusion of environmentally sound technologies to developing countries on favourable terms, including on concessional and preferential terms, as mutually agreed"]
["17.8","Fully operationalize the technology bank and science, technology and innovation capacity-building mechanism for least developed countries by 2017 and enhance the use of enabling technology, in particular information and communications technology"]
["17.9","Enhance international support for implementing effective and targeted capacity-building in developing countries to support national plans to implement all the Sustainable Development Goals, including through North-South, South-South and triangular cooperation"]
["17.10","Promote a universal, rules-based, open, non-discriminatory and equitable multilateral trading system under the World Trade Organization, including through the conclusion of negotiations under its Doha Development Agenda"]
["17.11","Significantly increase the exports of developing countries, in particular with a view to doubling the least developed countries’ share of global exports by 2020"]
["17.12","Realize timely implementation of duty-free and quota-free market access on a lasting basis for all least developed countries, consistent with World Trade Organization decisions, including by ensuring that preferential rules of origin applicable to imports from least developed countries are transparent and simple, and contribute to facilitating market access"]
["17.13","Enhance global macroeconomic stability, including through policy coordination and policy coherence"]
["17.14","Enhance policy coherence for sustainable development"]
["17.15","Respect each country’s policy space and leadership to establish and implement policies for poverty eradication and sustainable development"]
["17.16","Enhance the Global Partnership for Sustainable Development, complemented by multi-stakeholder partnerships that mobilize and share knowledge, expertise, technology and financial resources, to support the achievement of the Sustainable Development Goals in all countries, in particular developing countries"]
["17.17","Encourage and promote effective public, public-private and civil society partnerships, building on the experience and resourcing strategies of partnerships"]
["17.18","By 2020, enhance capacity-building support to developing countries, including for least developed countries and small island developing States, to increase significantly the availability of high-quality, timely and reliable data disaggregated by income, gender, age, race, ethnicity, migratory status, disability, geographic location and other characteristics relevant in national contexts"]
["17.19","By 2030, build on existing initiatives to develop measurements of progress on sustainable development that complement gross domestic product, and support statistical capacity-building in developing countries"]
["1.0"]
["2.0"]
["3.0"]
["4.0"]
["5.0"]
["6.0"]
["7.0"]
["8.0"]
["9.0"]
["10.0"]
["11.0"]
["12.0"]
["13.0"]
["14.0"]
["15.0"]
["16.0"]
["17.0"]

{"sheet":"type_of_flow","index":14,"n_rows":9,"n_cols":5,"rows_kept":9,"cut":false,"hidden":true,"merged":[]}
["code","name","Description","Nom","Description"]
[10,"ODA ","Official Development Assistance","APD ","Aide Publique au Développement"]
[21,"Non-export credit OOF","Other Official Flows, excl. export credits.","AASP hors crédits-export","Autres Apports du Secteur Public, à l'exclusion des crédits à  l'exportation"]
[22,"Officially supported export credits","Officially supported export credits. Covers both official direct export credits and private export credits under official guarantee or insurance.","AASP dont crédits export","Autres Apports du Secteur Public. comprenant les crédits à  l'exportation soutenus par le secteur public et les exportations privées bénéficiant de garantie ou d'assurance publiques."]
[30,"Private grants","made by NGOs and other civil society organisations (e.e. philantropic foundations) based in the reporting DAC country","Dons privés  ","Dons fournis par les ONG et autres organismes privés (par exemple fondations philantropiques) résidents dans le pays donneur"]
[36,"Private Foreign Direct Investment","Private Foreign Direct Investment.","IDE","Investissements directs à l'étranger"]
[37,"Other Private flows at market terms","Private long-term (i.e. over one-year maturity) capital transactions made by residents of DAC countries.","Autres apports privés aux conditions du marché","Apports privés de long-terme (i.e. dont la maturité est  supérieure à un an), transactions en capital faites par des résidents de pays du CAD."]
[40,"Non flow ","e.g. GNI","non apports","ex : RNB"]
[50,"Other flows","e.g. non-ODA component of peacebuilding operations)","Autres apports","ex : élément non APD des opérations de maintien de la paix"]

{"sheet":"recipient_country","index":15,"n_rows":178,"n_cols":30,"rows_kept":178,"cut":false,"hidden":true,"merged":[]}
["Recipient code","Recipient name (EN)","Recipient name (FR)","DAC_IncomeGroup","Region",null,null,null,null,null,null,null,null,null,null,null,null,null,null,null,null,null,null,null,null,null,"TOSSD","Country/institution code","Country/institution name (EN)","groupid"]
[55,"Türkiye","Türkiye","UMICs","Europe",null,null,null,null,null,null,null,null,null,null,null,null,null,null,null,null,null,null,null,null,null,null,55,"Türkiye",10019]
[57,"Kosovo","Kosovo","UMICs","Europe",null,null,null,null,null,null,null,null,null,null,null,null,null,null,null,null,null,null,null,null,null,null,57,"Kosovo",10019]
[63,"Serbia","Serbie","UMICs","Europe",null,null,null,null,null,null,null,null,null,null,null,null,null,null,null,null,null,null,null,null,null,null,63,"Serbia",10019]
[64,"Bosnia and Herzegovina","Bosnie-Herzégovine","UMICs","Europe",null,null,null,null,null,null,null,null,null,null,null,null,null,null,null,null,null,null,null,null,null,null,64,"Bosnia and Herzegovina",10019]
[65,"Montenegro","Monténégro","UMICs","Europe",null,null,null,null,null,null,null,null,null,null,null,null,null,null,null,null,null,null,null,null,null,null,65,"Montenegro",10019]
[66,"North Macedonia","Macédoine du Nord","UMICs","Europe",null,null,null,null,null,null,null,null,null,null,null,null,null,null,null,null,null,null,null,null,null,null,66,"North Macedonia",10019]
[71,"Albania","Albanie","UMICs","Europe",null,null,null,null,null,null,null,null,null,null,null,null,null,null,null,null,null,null,null,null,null,null,71,"Albania",10019]
[85,"Ukraine","Ukraine","LMICs","Europe",null,null,null,null,null,null,null,null,null,null,null,null,null,null,null,null,null,null,null,null,null,null,85,"Ukraine",10018]
[86,"Belarus","Bélarus","UMICs","Europe",null,null,null,null,null,null,null,null,null,null,null,null,null,null,null,null,null,null,null,null,null,null,86,"Belarus",10019]
[88,"States Ex-Yugoslavia unspecified","Etats ex-Yougoslavie non spécifié","Part I unallocated by income","Europe",null,null,null,null,null,null,null,null,null,null,null,null,null,null,null,null,null,null,null,null,null,null,88,"States Ex-Yugoslavia unspecified",10024]
[89,"Europe, regional","Europe, régional","Part I unallocated by income","Europe",null,null,null,null,null,null,null,null,null,null,null,null,null,null,null,null,null,null,null,null,null,null,89,"Europe, regional",10024]
[93,"Moldova","Moldova","UMICs","Europe",null,null,null,null,null,null,null,null,null,null,null,null,null,null,null,null,null,null,null,null,null,null,93,"Moldova",10019]
[130,"Algeria","Algérie","LMICs","North of Sahara",null,null,null,null,null,null,null,null,null,null,null,null,null,null,null,null,null,null,null,null,null,null,130,"Algeria",10018]
[133,"Libya","Libye","UMICs","North of Sahara",null,null,null,null,null,null,null,null,null,null,null,null,null,null,null,null,null,null,null,null,null,null,133,"Libya",10019]
[136,"Morocco","Maroc","LMICs","North of Sahara",null,null,null,null,null,null,null,null,null,null,null,null,null,null,null,null,null,null,null,null,null,null,136,"Morocco",10018]
[139,"Tunisia","Tunisie","LMICs","North of Sahara",null,null,null,null,null,null,null,null,null,null,null,null,null,null,null,null,null,null,null,null,null,null,139,"Tunisia",10018]
[142,"Egypt","Egypte","LMICs","North of Sahara",null,null,null,null,null,null,null,null,null,null,null,null,null,null,null,null,null,null,null,null,null,null,142,"Egypt",10018]
[189,"North of Sahara, regional","Nord du Sahara, régional","Part I unallocated by income","North of Sahara",null,null,null,null,null,null,null,null,null,null,null,null,null,null,null,null,null,null,null,null,null,null,189,"North of Sahara, regional",10024]
[218,"South Africa","Afrique du Sud","UMICs","Southern Africa",null,null,null,null,null,null,null,null,null,null,null,null,null,null,null,null,null,null,null,null,null,null,218,"South Africa",10019]
[225,"Angola","Angola","LDCs","Middle Africa",null,null,null,null,null,null,null,null,null,null,null,null,null,null,null,null,null,null,null,null,null,null,225,"Angola",10016]
[227,"Botswana","Botswana","UMICs","Southern Africa",null,null,null,null,null,null,null,null,null,null,null,null,null,null,null,null,null,null,null,null,null,null,227,"Botswana",10019]
[228,"Burundi","Burundi","LDCs","Eastern Africa",null,null,null,null,null,null,null,null,null,null,null,null,null,null,null,null,null,null,null,null,null,null,228,"Burundi",10016]
[229,"Cameroon","Cameroun","LMICs","Middle Africa",null,null,null,null,null,null,null,null,null,null,null,null,null,null,null,null,null,null,null,null,null,null,229,"Cameroon",10018]
[230,"Cabo Verde","Cabo Verde","LMICs","Western Africa",null,null,null,null,null,null,null,null,null,null,null,null,null,null,null,null,null,null,null,null,null,null,230,"Cabo Verde",10018]
[231,"Central African Republic","République centrafricaine","LDCs","Middle Africa",null,null,null,null,null,null,null,null,null,null,null,null,null,null,null,null,null,null,null,null,null,null,231,"Central African Republic",10016]
[232,"Chad","Tchad","LDCs","Middle Africa",null,null,null,null,null,null,null,null,null,null,null,null,null,null,null,null,null,null,null,null,null,null,232,"Chad",10016]
[233,"Comoros","Comores","LDCs","Eastern Africa",null,null,null,null,null,null,null,null,null,null,null,null,null,null,null,null,null,null,null,null,null,null,233,"Comoros",10016]
[234,"Congo","Congo","LMICs","Middle Africa",null,null,null,null,null,null,null,null,null,null,null,null,null,null,null,null,null,null,null,null,null,null,234,"Congo",10018]
[235,"Democratic Republic of the Congo","République démocratique du Congo","LDCs","Middle Africa",null,null,null,null,null,null,null,null,null,null,null,null,null,null,null,null,null,null,null,null,null,null,235,"Democratic Republic of the Congo",10016]
[236,"Benin","Bénin","LDCs","Western Africa",null,null,null,null,null,null,null,null,null,null,null,null,null,null,null,null,null,null,null,null,null,null,236,"Benin",10016]
[238,"Ethiopia","Ethiopie","LDCs","Eastern Africa",null,null,null,null,null,null,null,null,null,null,null,null,null,null,null,null,null,null,null,null,null,null,238,"Ethiopia",10016]
[239,"Gabon","Gabon","UMICs","Middle Africa",null,null,null,null,null,null,null,null,null,null,null,null,null,null,null,null,null,null,null,null,null,null,239,"Gabon",10019]
[240,"Gambia","Gambie","LDCs","Western Africa",null,null,null,null,null,null,null,null,null,null,null,null,null,null,null,null,null,null,null,null,null,null,240,"Gambia",10016]
[241,"Ghana","Ghana","LMICs","Western Africa",null,null,null,null,null,null,null,null,null,null,null,null,null,null,null,null,null,null,null,null,null,null,241,"Ghana",10018]
[243,"Guinea","Guinée","LDCs","Western Africa",null,null,null,null,null,null,null,null,null,null,null,null,null,null,null,null,null,null,null,null,null,null,243,"Guinea",10016]
[244,"Guinea-Bissau","Guinée-Bissau","LDCs","Western Africa",null,null,null,null,null,null,null,null,null,null,null,null,null,null,null,null,null,null,null,null,null,null,244,"Guinea-Bissau",10016]
[245,"Equatorial Guinea","Guinée équatoriale","UMICs","Middle Africa",null,null,null,null,null,null,null,null,null,null,null,null,null,null,null,null,null,null,null,null,null,null,245,"Equatorial Guinea",10019]
[247,"Côte d'Ivoire","Côte d'Ivoire","LMICs","Western Africa",null,null,null,null,null,null,null,null,null,null,null,null,null,null,null,null,null,null,null,null,null,null,247,"Côte d'Ivoire",10018]
[248,"Kenya","Kenya","LMICs","Eastern Africa",null,null,null,null,null,null,null,null,null,null,null,null,null,null,null,null,null,null,null,null,null,null,248,"Kenya",10018]
[249,"Lesotho","Lesotho","LDCs","Southern Africa",null,null,null,null,null,null,null,null,null,null,null,null,null,null,null,null,null,null,null,null,null,null,249,"Lesotho",10016]
[251,"Liberia","Libéria","LDCs","Western Africa",null,null,null,null,null,null,null,null,null,null,null,null,null,null,null,null,null,null,null,null,null,null,251,"Liberia",10016]
[252,"Madagascar","Madagascar","LDCs","Eastern Africa",null,null,null,null,null,null,null,null,null,null,null,null,null,null,null,null,null,null,null,null,null,null,252,"Madagascar",10016]
[253,"Malawi","Malawi","LDCs","Eastern Africa",null,null,null,null,null,null,null,null,null,null,null,null,null,null,null,null,null,null,null,null,null,null,253,"Malawi",10016]
[255,"Mali","Mali","LDCs","Western Africa",null,null,null,null,null,null,null,null,null,null,null,null,null,null,null,null,null,null,null,null,null,null,255,"Mali",10016]
[256,"Mauritania","Mauritanie","LDCs","Western Africa",null,null,null,null,null,null,null,null,null,null,null,null,null,null,null,null,null,null,null,null,null,null,256,"Mauritania",10016]
[257,"Mauritius","Maurice","UMICs","Eastern Africa",null,null,null,null,null,null,null,null,null,null,null,null,null,null,null,null,null,null,null,null,null,null,257,"Mauritius",10019]
[259,"Mozambique","Mozambique","LDCs","Eastern Africa",null,null,null,null,null,null,null,null,null,null,null,null,null,null,null,null,null,null,null,null,null,null,259,"Mozambique",10016]
[260,"Niger","Niger","LDCs","Western Africa",null,null,null,null,null,null,null,null,null,null,null,null,null,null,null,null,null,null,null,null,null,null,260,"Niger",10016]
[261,"Nigeria","Nigéria","LMICs","Western Africa",null,null,null,null,null,null,null,null,null,null,null,null,null,null,null,null,null,null,null,null,null,null,261,"Nigeria",10018]
[265,"Zimbabwe","Zimbabwe","LMICs","Eastern Africa",null,null,null,null,null,null,null,null,null,null,null,null,null,null,null,null,null,null,null,null,null,null,265,"Zimbabwe",10018]
[266,"Rwanda","Rwanda","LDCs","Eastern Africa",null,null,null,null,null,null,null,null,null,null,null,null,null,null,null,null,null,null,null,null,null,null,266,"Rwanda",10016]
[268,"Sao Tome and Principe","Sao Tomé-et-Principe","LDCs","Middle Africa",null,null,null,null,null,null,null,null,null,null,null,null,null,null,null,null,null,null,null,null,null,null,268,"Sao Tome and Principe",10016]
[269,"Senegal","Sénégal","LDCs","Western Africa",null,null,null,null,null,null,null,null,null,null,null,null,null,null,null,null,null,null,null,null,null,null,269,"Senegal",10016]
[271,"Eritrea","Erythrée","LDCs","Eastern Africa",null,null,null,null,null,null,null,null,null,null,null,null,null,null,null,null,null,null,null,null,null,null,270,"Seychelles",10025]
[272,"Sierra Leone","Sierra Leone","LDCs","Western Africa",null,null,null,null,null,null,null,null,null,null,null,null,null,null,null,null,null,null,null,null,null,null,271,"Eritrea",10016]
[273,"Somalia","Somalie","LDCs","Eastern Africa",null,null,null,null,null,null,null,null,null,null,null,null,null,null,null,null,null,null,null,null,null,null,272,"Sierra Leone",10016]
[274,"Djibouti","Djibouti","LDCs","Eastern Africa",null,null,null,null,null,null,null,null,null,null,null,null,null,null,null,null,null,null,null,null,null,null,273,"Somalia",10016]
[275,"Namibia","Namibie","UMICs","Southern Africa",null,null,null,null,null,null,null,null,null,null,null,null,null,null,null,null,null,null,null,null,null,null,274,"Djibouti",10016]
[276,"Saint Helena","Sainte-Hélène","UMICs","Western Africa",null,null,null,null,null,null,null,null,null,null,null,null,null,null,null,null,null,null,null,null,null,null,275,"Namibia",10019]
[278,"Sudan","Soudan","LDCs","Eastern Africa",null,null,null,null,null,null,null,null,null,null,null,null,null,null,null,null,null,null,null,null,null,null,276,"Saint Helena",10019]
[279,"South Sudan","Soudan du Sud","LDCs","Eastern Africa",null,null,null,null,null,null,null,null,null,null,null,null,null,null,null,null,null,null,null,null,null,null,278,"Sudan",10016]
[280,"Eswatini","Eswatini","LMICs","Southern Africa",null,null,null,null,null,null,null,null,null,null,null,null,null,null,null,null,null,null,null,null,null,null,279,"South Sudan",10016]
[282,"Tanzania","Tanzanie","LDCs","Eastern Africa",null,null,null,null,null,null,null,null,null,null,null,null,null,null,null,null,null,null,null,null,null,null,280,"Eswatini",10018]
[283,"Togo","Togo","LDCs","Western Africa",null,null,null,null,null,null,null,null,null,null,null,null,null,null,null,null,null,null,null,null,null,null,282,"Tanzania",10016]
[285,"Uganda","Ouganda","LDCs","Eastern Africa",null,null,null,null,null,null,null,null,null,null,null,null,null,null,null,null,null,null,null,null,null,null,283,"Togo",10016]
[287,"Burkina Faso","Burkina Faso","LDCs","Western Africa",null,null,null,null,null,null,null,null,null,null,null,null,null,null,null,null,null,null,null,null,null,null,285,"Uganda",10016]
[288,"Zambia","Zambie","LDCs","Eastern Africa",null,null,null,null,null,null,null,null,null,null,null,null,null,null,null,null,null,null,null,null,null,null,287,"Burkina Faso",10016]
[289,"South of Sahara, regional","Sud du Sahara, régional","Part I unallocated by income","South of Sahara",null,null,null,null,null,null,null,null,null,null,null,null,null,null,null,null,null,null,null,null,null,null,288,"Zambia",10016]
[298,"Africa, regional","Afrique, régional","Part I unallocated by income","Africa",null,null,null,null,null,null,null,null,null,null,null,null,null,null,null,null,null,null,null,null,null,null,289,"South of Sahara, regional",10024]
[336,"Costa Rica","Costa Rica","UMICs","Central America",null,null,null,null,null,null,null,null,null,null,null,null,null,null,null,null,null,null,null,null,null,null,298,"Africa, regional",10024]
[338,"Cuba","Cuba","UMICs","Caribbean",null,null,null,null,null,null,null,null,null,null,null,null,null,null,null,null,null,null,null,null,null,null,328,"Bahamas",10025]
[340,"Dominican Republic","République dominicaine","UMICs","Caribbean",null,null,null,null,null,null,null,null,null,null,null,null,null,null,null,null,null,null,null,null,null,null,329,"Barbados",10025]
[342,"El Salvador","El Salvador","UMICs","Central America",null,null,null,null,null,null,null,null,null,null,null,null,null,null,null,null,null,null,null,null,null,null,336,"Costa Rica",10019]
[347,"Guatemala","Guatemala","UMICs","Central America",null,null,null,null,null,null,null,null,null,null,null,null,null,null,null,null,null,null,null,null,null,null,338,"Cuba",10019]
[349,"Haiti","Haïti","LDCs","Caribbean",null,null,null,null,null,null,null,null,null,null,null,null,null,null,null,null,null,null,null,null,null,null,340,"Dominican Republic",10019]
[351,"Honduras","Honduras","LMICs","Central America",null,null,null,null,null,null,null,null,null,null,null,null,null,null,null,null,null,null,null,null,null,null,342,"El Salvador",10019]
[352,"Belize","Belize","UMICs","Central America",null,null,null,null,null,null,null,null,null,null,null,null,null,null,null,null,null,null,null,null,null,null,347,"Guatemala",10019]
[354,"Jamaica","Jamaïque","UMICs","Caribbean",null,null,null,null,null,null,null,null,null,null,null,null,null,null,null,null,null,null,null,null,null,null,349,"Haiti",10016]
[358,"Mexico","Mexique","UMICs","Central America",null,null,null,null,null,null,null,null,null,null,null,null,null,null,null,null,null,null,null,null,null,null,351,"Honduras",10018]
[364,"Nicaragua","Nicaragua","LMICs","Central America",null,null,null,null,null,null,null,null,null,null,null,null,null,null,null,null,null,null,null,null,null,null,352,"Belize",10019]
[366,"Panama","Panama","UMICs","Central America",null,null,null,null,null,null,null,null,null,null,null,null,null,null,null,null,null,null,null,null,null,null,354,"Jamaica",10019]
[378,"Dominica","Dominique","UMICs","Caribbean",null,null,null,null,null,null,null,null,null,null,null,null,null,null,null,null,null,null,null,null,null,null,358,"Mexico",10019]
[381,"Grenada","Grenade","UMICs","Caribbean",null,null,null,null,null,null,null,null,null,null,null,null,null,null,null,null,null,null,null,null,null,null,364,"Nicaragua",10018]
[383,"Saint Lucia","Sainte-Lucie","UMICs","Caribbean",null,null,null,null,null,null,null,null,null,null,null,null,null,null,null,null,null,null,null,null,null,null,366,"Panama",10019]
[384,"Saint Vincent and the Grenadines","Saint-Vincent-et-les-Grenadines","UMICs","Caribbean",null,null,null,null,null,null,null,null,null,null,null,null,null,null,null,null,null,null,null,null,null,null,375,"Trinidad and Tobago",10025]
[385,"Montserrat","Montserrat","UMICs","Caribbean",null,null,null,null,null,null,null,null,null,null,null,null,null,null,null,null,null,null,null,null,null,null,377,"Antigua and Barbuda",10025]
[389,"Caribbean & Central America, regional","Caraïbes et Amérique centrale, régional","Part I unallocated by income","Caribbean & Central America",null,null,null,null,null,null,null,null,null,null,null,null,null,null,null,null,null,null,null,null,null,null,378,"Dominica",10019]
[425,"Argentina","Argentine","UMICs","South America",null,null,null,null,null,null,null,null,null,null,null,null,null,null,null,null,null,null,null,null,null,null,381,"Grenada",10019]
[428,"Bolivia","Bolivie","LMICs","South America",null,null,null,null,null,null,null,null,null,null,null,null,null,null,null,null,null,null,null,null,null,null,382,"Saint Kitts and Nevis",10025]
[431,"Brazil","Brésil","UMICs","South America",null,null,null,null,null,null,null,null,null,null,null,null,null,null,null,null,null,null,null,null,null,null,383,"Saint Lucia",10019]
[437,"Colombia","Colombie","UMICs","South America",null,null,null,null,null,null,null,null,null,null,null,null,null,null,null,null,null,null,null,null,null,null,384,"Saint Vincent and the Grenadines",10019]
[440,"Ecuador","Equateur","UMICs","South America",null,null,null,null,null,null,null,null,null,null,null,null,null,null,null,null,null,null,null,null,null,null,385,"Montserrat",10019]
[446,"Guyana","Guyana","UMICs","South America",null,null,null,null,null,null,null,null,null,null,null,null,null,null,null,null,null,null,null,null,null,null,389,"Caribbean & Central America, regional",10024]
[451,"Paraguay","Paraguay","UMICs","South America",null,null,null,null,null,null,null,null,null,null,null,null,null,null,null,null,null,null,null,null,null,null,425,"Argentina",10019]
[454,"Peru","Pérou","UMICs","South America",null,null,null,null,null,null,null,null,null,null,null,null,null,null,null,null,null,null,null,null,null,null,428,"Bolivia",10018]
[457,"Suriname","Suriname","UMICs","South America",null,null,null,null,null,null,null,null,null,null,null,null,null,null,null,null,null,null,null,null,null,null,431,"Brazil",10019]
[463,"Venezuela","Venezuela","UMICs","South America",null,null,null,null,null,null,null,null,null,null,null,null,null,null,null,null,null,null,null,null,null,null,434,"Chile",10025]
[489,"South America, regional","Amérique du Sud, régional","Part I unallocated by income","South America",null,null,null,null,null,null,null,null,null,null,null,null,null,null,null,null,null,null,null,null,null,null,437,"Colombia",10019]
[498,"America, regional","Amérique, régional","Part I unallocated by income","America",null,null,null,null,null,null,null,null,null,null,null,null,null,null,null,null,null,null,null,null,null,null,440,"Ecuador",10019]
[540,"Iran","Iran","LMICs","Middle East",null,null,null,null,null,null,null,null,null,null,null,null,null,null,null,null,null,null,null,null,null,null,446,"Guyana",10019]
[543,"Iraq","Iraq","UMICs","Middle East",null,null,null,null,null,null,null,null,null,null,null,null,null,null,null,null,null,null,null,null,null,null,451,"Paraguay",10019]
[549,"Jordan","Jordanie","LMICs","Middle East",null,null,null,null,null,null,null,null,null,null,null,null,null,null,null,null,null,null,null,null,null,null,454,"Peru",10019]
[550,"West Bank and Gaza Strip","Cisjordanie et bande de Gaza","UMICs","Middle East",null,null,null,null,null,null,null,null,null,null,null,null,null,null,null,null,null,null,null,null,null,null,457,"Suriname",10019]
[555,"Lebanon","Liban","LMICs","Middle East",null,null,null,null,null,null,null,null,null,null,null,null,null,null,null,null,null,null,null,null,null,null,460,"Uruguay",10025]
[573,"Syrian Arab Republic","République arabe syrienne","Other LICs","Middle East",null,null,null,null,null,null,null,null,null,null,null,null,null,null,null,null,null,null,null,null,null,null,463,"Venezuela",10019]
[580,"Yemen","Yémen","LDCs","Middle East",null,null,null,null,null,null,null,null,null,null,null,null,null,null,null,null,null,null,null,null,null,null,489,"South America, regional",10024]
[589,"Middle East, regional","Moyen-Orient, régional","Part I unallocated by income","Middle East",null,null,null,null,null,null,null,null,null,null,null,null,null,null,null,null,null,null,null,null,null,null,498,"America, regional",10024]
[610,"Armenia","Arménie","UMICs","South & Central Asia",null,null,null,null,null,null,null,null,null,null,null,null,null,null,null,null,null,null,null,null,null,null,540,"Iran",10018]
[611,"Azerbaijan","Azerbaïdjan","UMICs","South & Central Asia",null,null,null,null,null,null,null,null,null,null,null,null,null,null,null,null,null,null,null,null,null,null,543,"Iraq",10019]
[612,"Georgia","Géorgie","UMICs","South & Central Asia",null,null,null,null,null,null,null,null,null,null,null,null,null,null,null,null,null,null,null,null,null,null,549,"Jordan",10018]
[613,"Kazakhstan","Kazakhstan","UMICs","South & Central Asia",null,null,null,null,null,null,null,null,null,null,null,null,null,null,null,null,null,null,null,null,null,null,550,"West Bank and Gaza Strip",10019]
[614,"Kyrgyzstan","Kirghizistan","LMICs","South & Central Asia",null,null,null,null,null,null,null,null,null,null,null,null,null,null,null,null,null,null,null,null,null,null,555,"Lebanon",10018]
[615,"Tajikistan","Tadjikistan","LMICs","South & Central Asia",null,null,null,null,null,null,null,null,null,null,null,null,null,null,null,null,null,null,null,null,null,null,573,"Syrian Arab Republic",10017]
[616,"Turkmenistan","Turkménistan","UMICs","South & Central Asia",null,null,null,null,null,null,null,null,null,null,null,null,null,null,null,null,null,null,null,null,null,null,580,"Yemen",10016]
[617,"Uzbekistan","Ouzbékistan","LMICs","South & Central Asia",null,null,null,null,null,null,null,null,null,null,null,null,null,null,null,null,null,null,null,null,null,null,589,"Middle East, regional",10024]
[619,"Central Asia, regional","Asie centrale, régional","Part I unallocated by income","South & Central Asia",null,null,null,null,null,null,null,null,null,null,null,null,null,null,null,null,null,null,null,null,null,null,610,"Armenia",10019]
[625,"Afghanistan","Afghanistan","LDCs","South & Central Asia",null,null,null,null,null,null,null,null,null,null,null,null,null,null,null,null,null,null,null,null,null,null,611,"Azerbaijan",10019]
[630,"Bhutan","Bhoutan","LMICs","South & Central Asia",null,null,null,null,null,null,null,null,null,null,null,null,null,null,null,null,null,null,null,null,null,null,612,"Georgia",10019]
[635,"Myanmar","Myanmar","LDCs","South & Central Asia",null,null,null,null,null,null,null,null,null,null,null,null,null,null,null,null,null,null,null,null,null,null,613,"Kazakhstan",10019]
[640,"Sri Lanka","Sri Lanka","LMICs","South & Central Asia",null,null,null,null,null,null,null,null,null,null,null,null,null,null,null,null,null,null,null,null,null,null,614,"Kyrgyzstan",10018]
[645,"India","Inde","LMICs","South & Central Asia",null,null,null,null,null,null,null,null,null,null,null,null,null,null,null,null,null,null,null,null,null,null,615,"Tajikistan",10018]
[655,"Maldives","Maldives","UMICs","South & Central Asia",null,null,null,null,null,null,null,null,null,null,null,null,null,null,null,null,null,null,null,null,null,null,616,"Turkmenistan",10019]
[660,"Nepal","Népal","LDCs","South & Central Asia",null,null,null,null,null,null,null,null,null,null,null,null,null,null,null,null,null,null,null,null,null,null,617,"Uzbekistan",10018]
[665,"Pakistan","Pakistan","LMICs","South & Central Asia",null,null,null,null,null,null,null,null,null,null,null,null,null,null,null,null,null,null,null,null,null,null,619,"Central Asia, regional",10024]
[666,"Bangladesh","Bangladesh","LDCs","South & Central Asia",null,null,null,null,null,null,null,null,null,null,null,null,null,null,null,null,null,null,null,null,null,null,625,"Afghanistan",10016]
[679,"South Asia, regional","Asie du Sud, régional","Part I unallocated by income","South & Central Asia",null,null,null,null,null,null,null,null,null,null,null,null,null,null,null,null,null,null,null,null,null,null,630,"Bhutan",10018]
[689,"South & Central Asia, regional","Asie du Sud & C., régional","Part I unallocated by income","South & Central Asia",null,null,null,null,null,null,null,null,null,null,null,null,null,null,null,null,null,null,null,null,null,null,635,"Myanmar",10016]
[728,"Cambodia","Cambodge","LDCs","Far East Asia",null,null,null,null,null,null,null,null,null,null,null,null,null,null,null,null,null,null,null,null,null,null,640,"Sri Lanka",10018]
[730,"China (People's Republic of)","Chine (République populaire de)","UMICs","Far East Asia",null,null,null,null,null,null,null,null,null,null,null,null,null,null,null,null,null,null,null,null,null,null,645,"India",10018]
[738,"Indonesia","Indonésie","UMICs","Far East Asia",null,null,null,null,null,null,null,null,null,null,null,null,null,null,null,null,null,null,null,null,null,null,655,"Maldives",10019]
[740,"Democratic People's Republic of Korea","République populaire démocratique de Corée","Other LICs","Far East Asia",null,null,null,null,null,null,null,null,null,null,null,null,null,null,null,null,null,null,null,null,null,null,660,"Nepal",10016]
[745,"Lao People's Democratic Republic","République démocratique populaire lao","LDCs","Far East Asia",null,null,null,null,null,null,null,null,null,null,null,null,null,null,null,null,null,null,null,null,null,null,665,"Pakistan",10018]
[751,"Malaysia","Malaisie","UMICs","Far East Asia",null,null,null,null,null,null,null,null,null,null,null,null,null,null,null,null,null,null,null,null,null,null,666,"Bangladesh",10016]
[753,"Mongolia","Mongolie","LMICs","Far East Asia",null,null,null,null,null,null,null,null,null,null,null,null,null,null,null,null,null,null,null,null,null,null,679,"South Asia, regional",10024]
[755,"Philippines","Philippines","LMICs","Far East Asia",null,null,null,null,null,null,null,null,null,null,null,null,null,null,null,null,null,null,null,null,null,null,689,"South & Central Asia, regional",10024]
[764,"Thailand","Thaïlande","UMICs","Far East Asia",null,null,null,null,null,null,null,null,null,null,null,null,null,null,null,null,null,null,null,null,null,null,725,"Brunei Darussalam",10025]
[765,"Timor-Leste","Timor-Leste","LDCs","Far East Asia",null,null,null,null,null,null,null,null,null,null,null,null,null,null,null,null,null,null,null,null,null,null,728,"Cambodia",10016]
[769,"Viet Nam","Viet Nam","LMICs","Far East Asia",null,null,null,null,null,null,null,null,null,null,null,null,null,null,null,null,null,null,null,null,null,null,730,"China (People's Republic of)",10019]
[789,"Far East Asia, regional","Extrême-Orient, régional","Part I unallocated by income","Far East Asia",null,null,null,null,null,null,null,null,null,null,null,null,null,null,null,null,null,null,null,null,null,null,738,"Indonesia",10019]
[798,"Asia, regional","Asie, régional","Part I unallocated by income","Asia",null,null,null,null,null,null,null,null,null,null,null,null,null,null,null,null,null,null,null,null,null,null,740,"Democratic People's Republic of Korea",10017]
[832,"Fiji","Fidji","UMICs","Melanesia",null,null,null,null,null,null,null,null,null,null,null,null,null,null,null,null,null,null,null,null,null,null,745,"Lao People's Democratic Republic",10016]
[836,"Kiribati","Kiribati","LDCs","Micronesia",null,null,null,null,null,null,null,null,null,null,null,null,null,null,null,null,null,null,null,null,null,null,751,"Malaysia",10019]
[845,"Nauru","Nauru","UMICs","Micronesia",null,null,null,null,null,null,null,null,null,null,null,null,null,null,null,null,null,null,null,null,null,null,753,"Mongolia",10018]
[854,"Vanuatu","Vanuatu","LMICs","Melanesia",null,null,null,null,null,null,null,null,null,null,null,null,null,null,null,null,null,null,null,null,null,null,755,"Philippines",10018]
[856,"Niue","Niue","UMICs","Polynesia",null,null,null,null,null,null,null,null,null,null,null,null,null,null,null,null,null,null,null,null,null,null,764,"Thailand",10019]
[859,"Marshall Islands","Iles Marshall","UMICs","Micronesia",null,null,null,null,null,null,null,null,null,null,null,null,null,null,null,null,null,null,null,null,null,null,765,"Timor-Leste",10016]
[860,"Micronesia","Micronésie","LMICs","Micronesia",null,null,null,null,null,null,null,null,null,null,null,null,null,null,null,null,null,null,null,null,null,null,769,"Viet Nam",10018]
[861,"Palau","Palaos","UMICs","Micronesia",null,null,null,null,null,null,null,null,null,null,null,null,null,null,null,null,null,null,null,null,null,null,789,"Far East Asia, regional",10024]
[862,"Papua New Guinea","Papouasie-Nouvelle-Guinée","LMICs","Melanesia",null,null,null,null,null,null,null,null,null,null,null,null,null,null,null,null,null,null,null,null,null,null,798,"Asia, regional",10024]
[866,"Solomon Islands","Îles Salomon","LDCs","Melanesia",null,null,null,null,null,null,null,null,null,null,null,null,null,null,null,null,null,null,null,null,null,null,831,"Cook Islands",10025]
[868,"Tokelau","Tokélaou","LMICs","Polynesia",null,null,null,null,null,null,null,null,null,null,null,null,null,null,null,null,null,null,null,null,null,null,832,"Fiji",10019]
[870,"Tonga","Tonga","UMICs","Polynesia",null,null,null,null,null,null,null,null,null,null,null,null,null,null,null,null,null,null,null,null,null,null,836,"Kiribati",10016]
[872,"Tuvalu","Tuvalu","LDCs","Polynesia",null,null,null,null,null,null,null,null,null,null,null,null,null,null,null,null,null,null,null,null,null,null,845,"Nauru",10019]
[876,"Wallis and Futuna","Wallis-et-Futuna","UMICs","Polynesia",null,null,null,null,null,null,null,null,null,null,null,null,null,null,null,null,null,null,null,null,null,null,854,"Vanuatu",10018]
[880,"Samoa","Samoa","LMICs","Polynesia",null,null,null,null,null,null,null,null,null,null,null,null,null,null,null,null,null,null,null,null,null,null,856,"Niue",10019]
[889,"Oceania, regional","Océanie, régional","Part I unallocated by income","Oceania",null,null,null,null,null,null,null,null,null,null,null,null,null,null,null,null,null,null,null,null,null,null,859,"Marshall Islands",10019]
[998,"Developing countries, unspecified","Pays en développement, non spécifié","Part I unallocated by income",null,null,null,null,null,null,null,null,null,null,null,null,null,null,null,null,null,null,null,null,null,null,null,860,"Micronesia",10018]
[1027,"Eastern Africa, regional","Afrique de l'est, régional","Part I unallocated by income","Eastern Africa",null,null,null,null,null,null,null,null,null,null,null,null,null,null,null,null,null,null,null,null,null,null,861,"Palau",10019]
[1028,"Middle Africa, regional","Afrique centrale, régional","Part I unallocated by income","Middle Africa",null,null,null,null,null,null,null,null,null,null,null,null,null,null,null,null,null,null,null,null,null,null,862,"Papua New Guinea",10018]
[1029,"Southern Africa, regional","Afrique australe, régional","Part I unallocated by income","Southern Africa",null,null,null,null,null,null,null,null,null,null,null,null,null,null,null,null,null,null,null,null,null,null,866,"Solomon Islands",10016]
[1030,"Western Africa, regional","Afrique occidentale, régional","Part I unallocated by income","Western Africa",null,null,null,null,null,null,null,null,null,null,null,null,null,null,null,null,null,null,null,null,null,null,868,"Tokelau",10018]
[1031,"Caribbean, regional","Caraïbes, régional","Part I unallocated by income","Caribbean",null,null,null,null,null,null,null,null,null,null,null,null,null,null,null,null,null,null,null,null,null,null,870,"Tonga",10019]
[1032,"Central America, regional","Amérique centrale, régional","Part I unallocated by income","Central America",null,null,null,null,null,null,null,null,null,null,null,null,null,null,null,null,null,null,null,null,null,null,872,"Tuvalu",10016]
[1033,"Melanesia, regional","Mélanésie, régional","Part I unallocated by income","Melanesia",null,null,null,null,null,null,null,null,null,null,null,null,null,null,null,null,null,null,null,null,null,null,876,"Wallis and Futuna",10019]
[1034,"Micronesia, regional","Micronésie, régional","Part I unallocated by income","Micronesia",null,null,null,null,null,null,null,null,null,null,null,null,null,null,null,null,null,null,null,null,null,null,880,"Samoa",10018]
[1035,"Polynesia, regional","Polynésie, régional","Part I unallocated by income","Polynesia",null,null,null,null,null,null,null,null,null,null,null,null,null,null,null,null,null,null,null,null,null,null,889,"Oceania, regional",10024]
[3000,"Multilateral",null,null,null,null,null,null,null,null,null,null,null,null,null,null,null,null,null,null,null,null,null,null,null,null,null,998,"Developing countries, unspecified",10024]
[270,"Seychelles",null,null,null,null,null,null,null,null,null,null,null,null,null,null,null,null,null,null,null,null,null,null,null,null,null,999,"Global",10024]
[328,"Bahamas",null,null,null,null,null,null,null,null,null,null,null,null,null,null,null,null,null,null,null,null,null,null,null,null,null,1027,"Eastern Africa, regional",10024]
[329,"Barbados",null,null,null,null,null,null,null,null,null,null,null,null,null,null,null,null,null,null,null,null,null,null,null,null,null,1028,"Middle Africa, regional",10024]
[375,"Trinidad and Tobago",null,null,null,null,null,null,null,null,null,null,null,null,null,null,null,null,null,null,null,null,null,null,null,null,null,1029,"Southern Africa, regional",10024]
[377,"Antigua and Barbuda",null,null,null,null,null,null,null,null,null,null,null,null,null,null,null,null,null,null,null,null,null,null,null,null,null,1030,"Western Africa, regional",10024]
[382,"Saint Kitts and Nevis",null,null,null,null,null,null,null,null,null,null,null,null,null,null,null,null,null,null,null,null,null,null,null,null,null,1031,"Caribbean, regional",10024]
[434,"Chile",null,null,null,null,null,null,null,null,null,null,null,null,null,null,null,null,null,null,null,null,null,null,null,null,null,1032,"Central America, regional",10024]
[460,"Uruguay",null,null,null,null,null,null,null,null,null,null,null,null,null,null,null,null,null,null,null,null,null,null,null,null,null,1033,"Melanesia, regional",10024]
[725,"Brunei Darussalam",null,null,null,null,null,null,null,null,null,null,null,null,null,null,null,null,null,null,null,null,null,null,null,null,null,1034,"Micronesia, regional",10024]
[831,"Cook Islands",null,null,null,null,null,null,null,null,null,null,null,null,null,null,null,null,null,null,null,null,null,null,null,null,null,1035,"Polynesia, regional",10024]

{"sheet":"nature_of_submission","index":16,"n_rows":7,"n_cols":3,"rows_kept":7,"cut":false,"hidden":true,"merged":[]}
["code","name","Nom"]
[1,"New activity reported","Activité nouvellement notifiée "]
[2,"Revision","Révision"]
[3,"Previously reported activity (increase/decrease of earlier commitment, disbursement on earlier commitment)","Activité déjà notifiée antérieurement (augmentation ou diminution d'un engagement antérieur, versmeent consécutif à un engagement antérieur)"]
[5,"Provisional data","Donnée préliminaire"]
[8,"Commitment = Disbursement","engagment = versement"]
[9,"Net disbursements","Versements nets"]

{"sheet":"Data validation sheet","index":17,"n_rows":219,"n_cols":11,"rows_kept":219,"cut":false,"hidden":true,"merged":[]}
["Leveraging mechanism and role/position","Origin of the funds mobilised","Project finance SPV flag \n(1=Yes)","Type of arranger","Methodology applied for calculation in field 23",null,null,null,"Code","Country","TOSSD pillar"]
["1=Syndicated loan, arranger","1=Provider country",1,"1=Official","OECD",null,null,null,2,"Belgium",0]
["2=Syndicated loan, participant","2=Recipient country ",null,"2=Private","MDB",null,null,null,3,"Denmark",0]
["3=Common shares in flat collective investment vehicle","3=Third high income/OECD country",null,null,null,null,null,null,4,"France",0]
["4=Shares in the riskiest tranche of structured collective investment vehicle, first-loss shares and others (e.g. lock-up shares)","4=Other third country",null,null,null,null,null,null,5,"Germany",0]
["5=Shares in the mezzanine/senior tranche of structured CIV","5=Other/multiple origins ",null,null,null,null,null,null,6,"Italy",0]
["6=Guarantee/insurance ",null,null,null,null,null,null,null,7,"Netherlands",0]
["7=Direct investment in companies/SPVs, equity",null,null,null,null,null,null,null,8,"Norway",0]
["8=Direct investment in companies/SPVs, mezzanine/senior debt",null,null,null,null,null,null,null,9,"Portugal",0]
["9=Credit lines",null,null,null,null,null,null,null,10,"Sweden",0]
["10=Simple co-financing",null,null,null,null,null,null,null,11,"Switzerland",0]
[null,null,null,null,null,null,null,null,12,"United Kingdom",0]
[null,null,null,null,null,null,null,null,18,"Finland",0]
[null,null,null,null,null,null,null,null,20,"Iceland",0]
[null,null,null,null,null,null,null,null,21,"Ireland",0]
[null,null,null,null,null,null,null,null,22,"Luxembourg",0]
[null,null,null,null,null,null,null,null,30,"Cyprus",0]
[null,null,null,null,null,null,null,null,40,"Greece",0]
[null,null,null,null,null,null,null,null,45,"Malta",0]
[null,null,null,null,null,null,null,null,50,"Spain",0]
[null,null,null,null,null,null,null,null,55,"Turkey",1]
[null,null,null,null,null,null,null,null,57,"Kosovo",1]
[null,null,null,null,null,null,null,null,61,"Slovenia",0]
[null,null,null,null,null,null,null,null,62,"Croatia",0]
[null,null,null,null,null,null,null,null,63,"Serbia",1]
[null,null,null,null,null,null,null,null,64,"Bosnia and Herzegovina",1]
[null,null,null,null,null,null,null,null,65,"Montenegro",1]
[null,null,null,null,null,null,null,null,66,"Northern Macedonia",1]
[null,null,null,null,null,null,null,null,68,"Czech Republic",0]
[null,null,null,null,null,null,null,null,69,"Slovak Republic",0]
[null,null,null,null,null,null,null,null,70,"Liechtenstein",0]
[null,null,null,null,null,null,null,null,71,"Albania",1]
[null,null,null,null,null,null,null,null,72,"Bulgaria",0]
[null,null,null,null,null,null,null,null,75,"Hungary",0]
[null,null,null,null,null,null,null,null,76,"Poland",0]
[null,null,null,null,null,null,null,null,77,"Romania",0]
[null,null,null,null,null,null,null,null,82,"Estonia",0]
[null,null,null,null,null,null,null,null,83,"Latvia",0]
[null,null,null,null,null,null,null,null,84,"Lithuania",0]
[null,null,null,null,null,null,null,null,85,"Ukraine",1]
[null,null,null,null,null,null,null,null,86,"Belarus",1]
[null,null,null,null,null,null,null,null,87,"Russia",0]
[null,null,null,null,null,null,null,null,88,"States Ex-Yugoslavia unspecified","manually"]
[null,null,null,null,null,null,null,null,89,"Europe, regional","manually"]
[null,null,null,null,null,null,null,null,93,"Moldova",1]
[null,null,null,null,null,null,null,null,130,"Algeria",1]
[null,null,null,null,null,null,null,null,133,"Libya",1]
[null,null,null,null,null,null,null,null,136,"Morocco",1]
[null,null,null,null,null,null,null,null,139,"Tunisia",1]
[null,null,null,null,null,null,null,null,142,"Egypt",1]
[null,null,null,null,null,null,null,null,189,"North of Sahara, regional","manually"]
[null,null,null,null,null,null,null,null,218,"South Africa",1]
[null,null,null,null,null,null,null,null,225,"Angola",1]
[null,null,null,null,null,null,null,null,227,"Botswana",1]
[null,null,null,null,null,null,null,null,228,"Burundi",1]
[null,null,null,null,null,null,null,null,229,"Cameroon",1]
[null,null,null,null,null,null,null,null,230,"Cabo Verde",1]
[null,null,null,null,null,null,null,null,231,"Central African Republic",1]
[null,null,null,null,null,null,null,null,232,"Chad",1]
[null,null,null,null,null,null,null,null,233,"Comoros",1]
[null,null,null,null,null,null,null,null,234,"Congo",1]
[null,null,null,null,null,null,null,null,235,"Democratic Republic of the Congo",1]
[null,null,null,null,null,null,null,null,236,"Benin",1]
[null,null,null,null,null,null,null,null,238,"Ethiopia",1]
[null,null,null,null,null,null,null,null,239,"Gabon",1]
[null,null,null,null,null,null,null,null,240,"Gambia",1]
[null,null,null,null,null,null,null,null,241,"Ghana",1]
[null,null,null,null,null,null,null,null,243,"Guinea",1]
[null,null,null,null,null,null,null,null,244,"Guinea-Bissau",1]
[null,null,null,null,null,null,null,null,245,"Equatorial Guinea",1]
[null,null,null,null,null,null,null,null,247,"Côte d'Ivoire",1]
[null,null,null,null,null,null,null,null,248,"Kenya",1]
[null,null,null,null,null,null,null,null,249,"Lesotho",1]
[null,null,null,null,null,null,null,null,251,"Liberia",1]
[null,null,null,null,null,null,null,null,252,"Madagascar",1]
[null,null,null,null,null,null,null,null,253,"Malawi",1]
[null,null,null,null,null,null,null,null,255,"Mali",1]
[null,null,null,null,null,null,null,null,256,"Mauritania",1]
[null,null,null,null,null,null,null,null,257,"Mauritius",1]
[null,null,null,null,null,null,null,null,259,"Mozambique",1]
[null,null,null,null,null,null,null,null,260,"Niger",1]
[null,null,null,null,null,null,null,null,261,"Nigeria",1]
[null,null,null,null,null,null,null,null,265,"Zimbabwe",1]
[null,null,null,null,null,null,null,null,266,"Rwanda",1]
[null,null,null,null,null,null,null,null,268,"Sao Tome and Principe",1]
[null,null,null,null,null,null,null,null,269,"Senegal",1]
[null,null,null,null,null,null,null,null,270,"Seychelles",0]
[null,null,null,null,null,null,null,null,271,"Eritrea",1]
[null,null,null,null,null,null,null,null,272,"Sierra Leone",1]
[null,null,null,null,null,null,null,null,273,"Somalia",1]
[null,null,null,null,null,null,null,null,274,"Djibouti",1]
[null,null,null,null,null,null,null,null,275,"Namibia",1]
[null,null,null,null,null,null,null,null,276,"Saint Helena",1]
[null,null,null,null,null,null,null,null,278,"Sudan",1]
[null,null,null,null,null,null,null,null,279,"South Sudan",1]
[null,null,null,null,null,null,null,null,280,"Eswatini",1]
[null,null,null,null,null,null,null,null,282,"Tanzania",1]
[null,null,null,null,null,null,null,null,283,"Togo",1]
[null,null,null,null,null,null,null,null,285,"Uganda",1]
[null,null,null,null,null,null,null,null,287,"Burkina Faso",1]
[null,null,null,null,null,null,null,null,288,"Zambia",1]
[null,null,null,null,null,null,null,null,289,"South of Sahara, regional","manually"]
[null,null,null,null,null,null,null,null,298,"Africa, regional","manually"]
[null,null,null,null,null,null,null,null,301,"Canada",0]
[null,null,null,null,null,null,null,null,302,"United States",0]
[null,null,null,null,null,null,null,null,336,"Costa Rica",1]
[null,null,null,null,null,null,null,null,338,"Cuba",1]
[null,null,null,null,null,null,null,null,340,"Dominican Republic",1]
[null,null,null,null,null,null,null,null,342,"El Salvador",1]
[null,null,null,null,null,null,null,null,347,"Guatemala",1]
[null,null,null,null,null,null,null,null,349,"Haiti",1]
[null,null,null,null,null,null,null,null,351,"Honduras",1]
[null,null,null,null,null,null,null,null,352,"Belize",1]
[null,null,null,null,null,null,null,null,354,"Jamaica",1]
[null,null,null,null,null,null,null,null,358,"Mexico",1]
[null,null,null,null,null,null,null,null,364,"Nicaragua",1]
[null,null,null,null,null,null,null,null,366,"Panama",1]
[null,null,null,null,null,null,null,null,377,"Antigua and Barbuda",1]
[null,null,null,null,null,null,null,null,378,"Dominica",1]
[null,null,null,null,null,null,null,null,381,"Grenada",1]
[null,null,null,null,null,null,null,null,383,"Saint Lucia",1]
[null,null,null,null,null,null,null,null,384,"Saint Vincent and the Grenadines",1]
[null,null,null,null,null,null,null,null,385,"Montserrat",1]
[null,null,null,null,null,null,null,null,389,"Caribbean & Central America, regional","manually"]
[null,null,null,null,null,null,null,null,425,"Argentina",1]
[null,null,null,null,null,null,null,null,428,"Bolivia",1]
[null,null,null,null,null,null,null,null,431,"Brazil",1]
[null,null,null,null,null,null,null,null,434,"Chile",0]
[null,null,null,null,null,null,null,null,437,"Colombia",1]
[null,null,null,null,null,null,null,null,440,"Ecuador",1]
[null,null,null,null,null,null,null,null,446,"Guyana",1]
[null,null,null,null,null,null,null,null,451,"Paraguay",1]
[null,null,null,null,null,null,null,null,454,"Peru",1]
[null,null,null,null,null,null,null,null,457,"Suriname",1]
[null,null,null,null,null,null,null,null,460,"Uruguay",0]
[null,null,null,null,null,null,null,null,463,"Venezuela",1]
[null,null,null,null,null,null,null,null,489,"South America, regional","manually"]
[null,null,null,null,null,null,null,null,498,"America, regional","manually"]
[null,null,null,null,null,null,null,null,530,"Bahrain",0]
[null,null,null,null,null,null,null,null,540,"Iran",1]
[null,null,null,null,null,null,null,null,543,"Iraq",1]
[null,null,null,null,null,null,null,null,546,"Israel",0]
[null,null,null,null,null,null,null,null,549,"Jordan",1]
[null,null,null,null,null,null,null,null,550,"West Bank and Gaza Strip",1]
[null,null,null,null,null,null,null,null,552,"Kuwait",0]
[null,null,null,null,null,null,null,null,555,"Lebanon",1]
[null,null,null,null,null,null,null,null,558,"Oman",0]
[null,null,null,null,null,null,null,null,561,"Qatar",0]
[null,null,null,null,null,null,null,null,566,"Saudi Arabia",0]
[null,null,null,null,null,null,null,null,573,"Syrian Arab Republic",1]
[null,null,null,null,null,null,null,null,576,"United Arab Emirates",0]
[null,null,null,null,null,null,null,null,580,"Yemen",1]
[null,null,null,null,null,null,null,null,589,"Middle East, regional","manually"]
[null,null,null,null,null,null,null,null,610,"Armenia",1]
[null,null,null,null,null,null,null,null,611,"Azerbaijan",1]
[null,null,null,null,null,null,null,null,612,"Georgia",1]
[null,null,null,null,null,null,null,null,613,"Kazakhstan",1]
[null,null,null,null,null,null,null,null,614,"Kyrgyzstan",1]
[null,null,null,null,null,null,null,null,615,"Tajikistan",1]
[null,null,null,null,null,null,null,null,616,"Turkmenistan",1]
[null,null,null,null,null,null,null,null,617,"Uzbekistan",1]
[null,null,null,null,null,null,null,null,619,"Central Asia, regional",1]
[null,null,null,null,null,null,null,null,625,"Afghanistan",1]
[null,null,null,null,null,null,null,null,630,"Bhutan",1]
[null,null,null,null,null,null,null,null,635,"Myanmar",1]
[null,null,null,null,null,null,null,null,640,"Sri Lanka",1]
[null,null,null,null,null,null,null,null,645,"India",1]
[null,null,null,null,null,null,null,null,655,"Maldives",1]
[null,null,null,null,null,null,null,null,660,"Nepal",1]
[null,null,null,null,null,null,null,null,665,"Pakistan",1]
[null,null,null,null,null,null,null,null,666,"Bangladesh",1]
[null,null,null,null,null,null,null,null,679,"South Asia, regional",1]
[null,null,null,null,null,null,null,null,689,"South & Central Asia, regional","manually"]
[null,null,null,null,null,null,null,null,701,"Japan",0]
[null,null,null,null,null,null,null,null,725,"Brunei Darussalam",0]
[null,null,null,null,null,null,null,null,728,"Cambodia",1]
[null,null,null,null,null,null,null,null,730,"China (People's Republic of)",1]
[null,null,null,null,null,null,null,null,732,"Chinese Taipei",0]
[null,null,null,null,null,null,null,null,735,"Hong Kong (China)",0]
[null,null,null,null,null,null,null,null,738,"Indonesia",1]
[null,null,null,null,null,null,null,null,740,"Democratic People's Republic of Korea",1]
[null,null,null,null,null,null,null,null,742,"Korea",0]
[null,null,null,null,null,null,null,null,745,"Lao People's Democratic Republic",1]
[null,null,null,null,null,null,null,null,751,"Malaysia",1]
[null,null,null,null,null,null,null,null,753,"Mongolia",1]
[null,null,null,null,null,null,null,null,755,"Philippines",1]
[null,null,null,null,null,null,null,null,761,"Singapore",0]
[null,null,null,null,null,null,null,null,764,"Thailand",1]
[null,null,null,null,null,null,null,null,765,"Timor-Leste",1]
[null,null,null,null,null,null,null,null,769,"Viet Nam",1]
[null,null,null,null,null,null,null,null,789,"Far East Asia, regional","manually"]
[null,null,null,null,null,null,null,null,798,"Asia, regional","manually"]
[null,null,null,null,null,null,null,null,831,"Cook Islands",0]
[null,null,null,null,null,null,null,null,832,"Fiji",1]
[null,null,null,null,null,null,null,null,836,"Kiribati",1]
[null,null,null,null,null,null,null,null,845,"Nauru",1]
[null,null,null,null,null,null,null,null,854,"Vanuatu",1]
[null,null,null,null,null,null,null,null,856,"Niue",1]
[null,null,null,null,null,null,null,null,859,"Marshall Islands",1]
[null,null,null,null,null,null,null,null,860,"Micronesia",1]
[null,null,null,null,null,null,null,null,861,"Palau",1]
[null,null,null,null,null,null,null,null,862,"Papua New Guinea",1]
[null,null,null,null,null,null,null,null,866,"Solomon Islands",1]
[null,null,null,null,null,null,null,null,868,"Tokelau",1]
[null,null,null,null,null,null,null,null,870,"Tonga",1]
[null,null,null,null,null,null,null,null,872,"Tuvalu",1]
[null,null,null,null,null,null,null,null,876,"Wallis and Futuna",1]
[null,null,null,null,null,null,null,null,880,"Samoa",1]
[null,null,null,null,null,null,null,null,889,"Oceania, regional","manually"]
[null,null,null,null,null,null,null,null,998,"Developing countries, unspecified",2]
[null,null,null,null,null,null,null,null,1027,"Eastern Africa, regional","manually"]
[null,null,null,null,null,null,null,null,1028,"Middle Africa, regional","manually"]
[null,null,null,null,null,null,null,null,1029,"Southern Africa, regional","manually"]
[null,null,null,null,null,null,null,null,1030,"Western Africa, regional","manually"]
[null,null,null,null,null,null,null,null,1031,"Caribbean, regional","manually"]
[null,null,null,null,null,null,null,null,1032,"Central America, regional","manually"]
[null,null,null,null,null,null,null,null,1033,"Melanesia, regional","manually"]
[null,null,null,null,null,null,null,null,1034,"Micronesia, regional","manually"]
[null,null,null,null,null,null,null,null,1035,"Polynesia, regional","manually"]

{"sheet":"Mobilisation codes","index":18,"n_rows":26,"n_cols":13,"rows_kept":26,"cut":false,"hidden":true,"merged":[[6,1,6,9],[6,12,6,20]]}
["Leveraging mechanism and role / position",null,null,null,null,null,null,null,null,null,null,"Mécanisme de levier et son rôle / sa position"]
[]
[]
[1,"Syndicated loan, arranger",null,null,null,null,null,null,null,null,null,1,"prêt syndiqué, arrangeur"]
[2,"Syndicated loan, participant",null,null,null,null,null,null,null,null,null,2,"prêt syndiqué, participant"]
[3,"Common share in flat collective investment vehicle",null,null,null,null,null,null,null,null,null,3,"action ordinaire dans un organisme de placement collectif simple"]
[4,"Shares in the riskiest tranche of structured collective investment vehicle, first loss share and other (e.g. lock up share)",null,null,null,null,null,null,null,null,null,4,"action dans la tranche la plus risquée d'un organisme de placement collectif structuré, position de première perte et autres (par ex. action bloquée)"]
[5,"Guarantee/insurance",null,null,null,null,null,null,null,null,null,5,"garantie/assurance"]
[6,"Guarantee/insurance"]
[7,"Direct investment in companies/SPVs, equity"]
[8,"Direct investment in companies/SPVs, mezzanine/senior debt"]
[9,"Credit lines"]
[10,"Simple co-financing"]
[]
[]
[]
[]
[]
[]
["Origin of the funds mobilised",null,null,null,null,null,null,null,null,null,null,"Origine des fonds mobilisés"]
[]
[1,"provider country",null,null,null,null,null,null,null,null,null,1,"pays donneur"]
[2,"recipient country",null,null,null,null,null,null,null,null,null,2,"pays bénéficiaire"]
[3,"third High income OECD country",null,null,null,null,null,null,null,null,null,3,"pays tiers à haut revenu/pays de l'OCDE "]
[4,"third developing country",null,null,null,null,null,null,null,null,null,4,"pays tiers en développement"]
[5,"multiple origins"]